Mock Version: 1.4.21
Mock Version: 1.4.21
ENTER ['do_with_status'](['bash', '--login', '-c', '/usr/bin/rpmbuild -bs --target riscv64 --nodeps /builddir/build/SPECS/libgcroots.spec'], chrootPath='/var/lib/mock/f33-build-333458-58335/root'env={'TERM': 'vt100', 'SHELL': '/bin/bash', 'HOME': '/builddir', 'HOSTNAME': 'mock', 'PATH': '/usr/bin:/bin:/usr/sbin:/sbin', 'PROMPT_COMMAND': 'printf "\\033]0;<mock-chroot>\\007"', 'PS1': '<mock-chroot> \\s-\\v\\$ ', 'LANG': 'en_US.UTF-8'}shell=Falselogger=<mockbuild.trace_decorator.getLog object at 0x3fd1fe5700>timeout=432000uid=987gid=135user='mockbuild'nspawn_args=[]unshare_net=TrueprintOutput=False)
Executing command: ['bash', '--login', '-c', '/usr/bin/rpmbuild -bs --target riscv64 --nodeps /builddir/build/SPECS/libgcroots.spec'] with env {'TERM': 'vt100', 'SHELL': '/bin/bash', 'HOME': '/builddir', 'HOSTNAME': 'mock', 'PATH': '/usr/bin:/bin:/usr/sbin:/sbin', 'PROMPT_COMMAND': 'printf "\\033]0;<mock-chroot>\\007"', 'PS1': '<mock-chroot> \\s-\\v\\$ ', 'LANG': 'en_US.UTF-8'} and shell False
Building target platforms: riscv64
Building for target riscv64
setting SOURCE_DATE_EPOCH=1595894400
Wrote: /builddir/build/SRPMS/libgcroots-0.3.1-6.fc33.src.rpm
Child return code was: 0
ENTER ['do_with_status'](['bash', '--login', '-c', '/usr/bin/rpmbuild -bb --target riscv64 --nodeps /builddir/build/SPECS/libgcroots.spec'], chrootPath='/var/lib/mock/f33-build-333458-58335/root'env={'TERM': 'vt100', 'SHELL': '/bin/bash', 'HOME': '/builddir', 'HOSTNAME': 'mock', 'PATH': '/usr/bin:/bin:/usr/sbin:/sbin', 'PROMPT_COMMAND': 'printf "\\033]0;<mock-chroot>\\007"', 'PS1': '<mock-chroot> \\s-\\v\\$ ', 'LANG': 'en_US.UTF-8'}shell=Falselogger=<mockbuild.trace_decorator.getLog object at 0x3fd1fe5700>timeout=432000uid=987gid=135user='mockbuild'nspawn_args=[]unshare_net=TrueprintOutput=False)
Executing command: ['bash', '--login', '-c', '/usr/bin/rpmbuild -bb --target riscv64 --nodeps /builddir/build/SPECS/libgcroots.spec'] with env {'TERM': 'vt100', 'SHELL': '/bin/bash', 'HOME': '/builddir', 'HOSTNAME': 'mock', 'PATH': '/usr/bin:/bin:/usr/sbin:/sbin', 'PROMPT_COMMAND': 'printf "\\033]0;<mock-chroot>\\007"', 'PS1': '<mock-chroot> \\s-\\v\\$ ', 'LANG': 'en_US.UTF-8'} and shell False
Building target platforms: riscv64
Building for target riscv64
setting SOURCE_DATE_EPOCH=1595894400
Executing(%prep): /bin/sh -e /var/tmp/rpm-tmp.BhW8xK
+ umask 022
+ cd /builddir/build/BUILD
+ cd /builddir/build/BUILD
+ rm -rf libgcroots-0.3.1
+ /usr/bin/bzip2 -dc /builddir/build/SOURCES/libgcroots-0.3.1.tar.bz2
+ /usr/bin/tar -xof -
+ STATUS=0
+ '[' 0 -ne 0 ']'
+ cd libgcroots-0.3.1
+ /usr/bin/chmod -Rf a+rX,u+w,g-w,o-w .
+ /usr/bin/cat /builddir/build/SOURCES/libgcroots-gcc10.patch
+ /usr/bin/patch -p1 -s --fuzz=0 --no-backup-if-mismatch
+ RPM_EC=0
++ jobs -p
+ exit 0
Executing(%build): /bin/sh -e /var/tmp/rpm-tmp.I21AZM
+ umask 022
+ cd /builddir/build/BUILD
+ cd libgcroots-0.3.1
+ CFLAGS='-O2 -flto=auto -ffat-lto-objects -fexceptions -g -grecord-gcc-switches -pipe -Wall -Werror=format-security -Wp,-D_FORTIFY_SOURCE=2 -Wp,-D_GLIBCXX_ASSERTIONS -specs=/usr/lib/rpm/redhat/redhat-hardened-cc1 -fstack-protector-strong -specs=/usr/lib/rpm/redhat/redhat-annobin-cc1  -fasynchronous-unwind-tables -fstack-clash-protection'
+ export CFLAGS
+ CXXFLAGS='-O2 -flto=auto -ffat-lto-objects -fexceptions -g -grecord-gcc-switches -pipe -Wall -Werror=format-security -Wp,-D_FORTIFY_SOURCE=2 -Wp,-D_GLIBCXX_ASSERTIONS -specs=/usr/lib/rpm/redhat/redhat-hardened-cc1 -fstack-protector-strong -specs=/usr/lib/rpm/redhat/redhat-annobin-cc1  -fasynchronous-unwind-tables -fstack-clash-protection'
+ export CXXFLAGS
+ FFLAGS='-O2 -flto=auto -ffat-lto-objects -fexceptions -g -grecord-gcc-switches -pipe -Wall -Werror=format-security -Wp,-D_FORTIFY_SOURCE=2 -Wp,-D_GLIBCXX_ASSERTIONS -specs=/usr/lib/rpm/redhat/redhat-hardened-cc1 -fstack-protector-strong -specs=/usr/lib/rpm/redhat/redhat-annobin-cc1  -fasynchronous-unwind-tables -fstack-clash-protection -I/usr/lib64/gfortran/modules'
+ export FFLAGS
+ FCFLAGS='-O2 -flto=auto -ffat-lto-objects -fexceptions -g -grecord-gcc-switches -pipe -Wall -Werror=format-security -Wp,-D_FORTIFY_SOURCE=2 -Wp,-D_GLIBCXX_ASSERTIONS -specs=/usr/lib/rpm/redhat/redhat-hardened-cc1 -fstack-protector-strong -specs=/usr/lib/rpm/redhat/redhat-annobin-cc1  -fasynchronous-unwind-tables -fstack-clash-protection -I/usr/lib64/gfortran/modules'
+ export FCFLAGS
+ LDFLAGS='-Wl,-z,relro -Wl,--as-needed  -Wl,-z,now -specs=/usr/lib/rpm/redhat/redhat-hardened-ld '
+ export LDFLAGS
+ LT_SYS_LIBRARY_PATH=/usr/lib64:
+ export LT_SYS_LIBRARY_PATH
+ CC=gcc
+ export CC
+ CXX=g++
+ export CXX
+ '[' '-flto=auto -ffat-lto-objectsx' '!=' x ']'
++ find . -type f -name configure -print
+ for file in $(find . -type f -name configure -print)
+ /usr/bin/sed -r --in-place=.backup 's/^char \(\*f\) \(\) = /__attribute__ ((used)) char (*f) () = /g' ./configure
+ diff -u ./configure.backup ./configure
+ mv ./configure.backup ./configure
+ /usr/bin/sed -r --in-place=.backup 's/^char \(\*f\) \(\);/__attribute__ ((used)) char (*f) ();/g' ./configure
+ diff -u ./configure.backup ./configure
+ mv ./configure.backup ./configure
+ /usr/bin/sed -r --in-place=.backup 's/^char \$2 \(\);/__attribute__ ((used)) char \$2 ();/g' ./configure
+ diff -u ./configure.backup ./configure
--- ./configure.backup	2018-05-09 21:39:43.000000000 -0400
+++ ./configure	2020-08-23 14:12:47.057635866 -0400
@@ -2055,7 +2055,7 @@
 #ifdef __cplusplus
 extern "C"
 #endif
-char $2 ();
+__attribute__ ((used)) char $2 ();
 /* The GNU C library defines this for functions which it implements
     to always fail with ENOSYS.  Some functions are actually named
     something starting with __ and the normal name is an alias.  */
+ /usr/bin/sed --in-place=.backup '1{$!N;$!N};$!N;s/int x = 1;\nint y = 0;\nint z;\nint nan;/volatile int x = 1; volatile int y = 0; volatile int z, nan;/;P;D' ./configure
+ diff -u ./configure.backup ./configure
+ mv ./configure.backup ./configure
+ /usr/bin/sed --in-place=.backup 's#^lt_cv_sys_global_symbol_to_cdecl=.*#lt_cv_sys_global_symbol_to_cdecl="sed -n -e '\''s/^T .* \\(.*\\)$/extern int \\1();/p'\'' -e '\''s/^$symcode* .* \\(.*\\)$/extern char \\1;/p'\''"#' ./configure
+ diff -u ./configure.backup ./configure
--- ./configure.backup	2020-08-23 14:12:47.057635866 -0400
+++ ./configure	2020-08-23 14:12:48.107635997 -0400
@@ -8403,7 +8403,7 @@
 # Transform an extracted symbol line into a proper C declaration.
 # Some systems (esp. on ia64) link data and code symbols differently,
 # so use this general approach.
-lt_cv_sys_global_symbol_to_cdecl="sed -n"\
+lt_cv_sys_global_symbol_to_cdecl="sed -n -e 's/^T .* \(.*\)$/extern int \1();/p' -e 's/^$symcode* .* \(.*\)$/extern char \1;/p'"
 $lt_cdecl_hook\
 " -e 's/^T .* \(.*\)$/extern int \1();/p'"\
 " -e 's/^$symcode$symcode* .* \(.*\)$/extern char \1;/p'"
@@ -15146,7 +15146,7 @@
 compiler='`$ECHO "$compiler" | $SED "$delay_single_quote_subst"`'
 GCC='`$ECHO "$GCC" | $SED "$delay_single_quote_subst"`'
 lt_cv_sys_global_symbol_pipe='`$ECHO "$lt_cv_sys_global_symbol_pipe" | $SED "$delay_single_quote_subst"`'
-lt_cv_sys_global_symbol_to_cdecl='`$ECHO "$lt_cv_sys_global_symbol_to_cdecl" | $SED "$delay_single_quote_subst"`'
+lt_cv_sys_global_symbol_to_cdecl="sed -n -e 's/^T .* \(.*\)$/extern int \1();/p' -e 's/^$symcode* .* \(.*\)$/extern char \1;/p'"
 lt_cv_sys_global_symbol_to_import='`$ECHO "$lt_cv_sys_global_symbol_to_import" | $SED "$delay_single_quote_subst"`'
 lt_cv_sys_global_symbol_to_c_name_address='`$ECHO "$lt_cv_sys_global_symbol_to_c_name_address" | $SED "$delay_single_quote_subst"`'
 lt_cv_sys_global_symbol_to_c_name_address_lib_prefix='`$ECHO "$lt_cv_sys_global_symbol_to_c_name_address_lib_prefix" | $SED "$delay_single_quote_subst"`'
+ '[' 1 = 1 ']'
+++ dirname ./configure
++ find . -name config.guess -o -name config.sub
+ for i in $(find $(dirname ./configure) -name config.guess -o -name config.sub)
++ basename ./config.sub
+ '[' -f /usr/lib/rpm/redhat/config.sub ']'
+ /usr/bin/rm -f ./config.sub
++ basename ./config.sub
+ /usr/bin/cp -fv /usr/lib/rpm/redhat/config.sub ./config.sub
'/usr/lib/rpm/redhat/config.sub' -> './config.sub'
+ for i in $(find $(dirname ./configure) -name config.guess -o -name config.sub)
++ basename ./config.guess
+ '[' -f /usr/lib/rpm/redhat/config.guess ']'
+ /usr/bin/rm -f ./config.guess
++ basename ./config.guess
+ /usr/bin/cp -fv /usr/lib/rpm/redhat/config.guess ./config.guess
'/usr/lib/rpm/redhat/config.guess' -> './config.guess'
+ '[' 1 = 1 ']'
+ '[' x '!=' 'x-Wl,-z,now -specs=/usr/lib/rpm/redhat/redhat-hardened-ld' ']'
++ find . -name ltmain.sh
+ for i in $(find . -name ltmain.sh)
+ /usr/bin/sed -i.backup -e 's~compiler_flags=$~compiler_flags="-Wl,-z,now -specs=/usr/lib/rpm/redhat/redhat-hardened-ld"~' ./ltmain.sh
+ ./configure --build=riscv64-redhat-linux-gnu --host=riscv64-redhat-linux-gnu --program-prefix= --disable-dependency-tracking --prefix=/usr --exec-prefix=/usr --bindir=/usr/bin --sbindir=/usr/sbin --sysconfdir=/etc --datadir=/usr/share --includedir=/usr/include --libdir=/usr/lib64 --libexecdir=/usr/libexec --localstatedir=/var --sharedstatedir=/var/lib --mandir=/usr/share/man --infodir=/usr/share/info --disable-static
checking build system type... riscv64-redhat-linux-gnu
checking host system type... riscv64-redhat-linux-gnu
checking target system type... riscv64-redhat-linux-gnu
checking for a BSD-compatible install... /usr/bin/install -c
checking whether build environment is sane... yes
checking for a thread-safe mkdir -p... /usr/bin/mkdir -p
checking for gawk... gawk
checking whether make sets $(MAKE)... yes
checking whether make supports nested variables... yes
checking whether to enable maintainer-specific portions of Makefiles... no
checking for style of include used by make... GNU
checking for riscv64-redhat-linux-gnu-gcc... gcc
checking whether the C compiler works... yes
checking for C compiler default output file name... a.out
checking for suffix of executables... 
checking whether we are cross compiling... no
checking for suffix of object files... o
checking whether we are using the GNU C compiler... yes
checking whether gcc accepts -g... yes
checking for gcc option to accept ISO C89... none needed
checking whether gcc understands -c and -o together... yes
checking dependency style of gcc... none
checking dependency style of gcc... none
checking for riscv64-redhat-linux-gnu-ar... no
checking for ar... ar
checking for riscv64-redhat-linux-gnu-ranlib... no
checking for ranlib... ranlib
checking for md5... no
checking for md5sum... /usr/bin/md5sum
checking for sha1... no
checking for sha1sum... /usr/bin/sha1sum
checking how to run the C preprocessor... gcc -E
checking for grep that handles long lines and -e... /usr/bin/grep
checking for egrep... /usr/bin/grep -E
checking for ANSI C header files... yes
checking for sys/types.h... yes
checking for sys/stat.h... yes
checking for stdlib.h... yes
checking for string.h... yes
checking for memory.h... yes
checking for strings.h... yes
checking for inttypes.h... yes
checking for stdint.h... yes
checking for unistd.h... yes
checking size of void *... 8
checking alignment of void *... 8
checking CFLAGS for gcc -pedantic... -pedantic
checking CFLAGS for gcc -Wall... -Wall
checking CFLAGS for gcc -Wchar-subscripts... -Wchar-subscripts
checking CFLAGS for gcc -Wmissing-declarations... -Wmissing-declarations
checking CFLAGS for gcc -Wredundant-decls... -Wredundant-decls
checking CFLAGS for gcc -Wmissing-prototypes... -Wmissing-prototypes
checking CFLAGS for gcc -Wnested-externs... -Wnested-externs
checking CFLAGS for gcc -Wpointer-arith... -Wpointer-arith
checking CFLAGS for gcc -Wcast-align... -Wcast-align
checking CFLAGS for gcc -Wsign-compare... -Wsign-compare
checking CFLAGS for gcc -no-cpp-precomp... no, unknown
checking for xlc... no
checking for dlopen in -ldl... yes
checking for getcontext... yes
checking whether to build shared libraries... yes
checking which machine-dependent code should be used... 
checking how to print strings... printf
checking for a sed that does not truncate output... /usr/bin/sed
checking for fgrep... /usr/bin/grep -F
checking for ld used by gcc... /usr/bin/ld
checking if the linker (/usr/bin/ld) is GNU ld... yes
checking for BSD- or MS-compatible name lister (nm)... /usr/bin/nm -B
checking the name lister (/usr/bin/nm -B) interface... BSD nm
checking whether ln -s works... yes
checking the maximum length of command line arguments... 1572864
checking how to convert riscv64-redhat-linux-gnu file names to riscv64-redhat-linux-gnu format... func_convert_file_noop
checking how to convert riscv64-redhat-linux-gnu file names to toolchain format... func_convert_file_noop
checking for /usr/bin/ld option to reload object files... -r
checking for riscv64-redhat-linux-gnu-objdump... no
checking for objdump... objdump
checking how to recognize dependent libraries... pass_all
checking for riscv64-redhat-linux-gnu-dlltool... no
checking for dlltool... no
checking how to associate runtime and link libraries... printf %s\n
checking for riscv64-redhat-linux-gnu-ar... ar
checking for archiver @FILE support... @
checking for riscv64-redhat-linux-gnu-strip... no
checking for strip... strip
checking for riscv64-redhat-linux-gnu-ranlib... ranlib
checking command to parse /usr/bin/nm -B output from gcc object... ./configure: line 8357:  -e 's/^T .* \(.*\)$/extern int \1();/p' -e 's/^[ABCDGIRSTW][ABCDGIRSTW]* .* \(.*\)$/extern char \1;/p': No such file or directory
ok
checking for sysroot... no
checking for a working dd... /usr/bin/dd
checking how to truncate binary pipes... /usr/bin/dd bs=4096 count=1
checking for riscv64-redhat-linux-gnu-mt... no
checking for mt... no
checking if : is a manifest tool... no
checking for dlfcn.h... yes
checking for objdir... .libs
checking if gcc supports -fno-rtti -fno-exceptions... no
checking for gcc option to produce PIC... -fPIC -DPIC
checking if gcc PIC flag -fPIC -DPIC works... yes
checking if gcc static flag -static works... no
checking if gcc supports -c -o file.o... yes
checking if gcc supports -c -o file.o... (cached) yes
checking whether the gcc linker (/usr/bin/ld) supports shared libraries... yes
checking whether -lc should be explicitly linked in... no
checking dynamic linker characteristics... GNU/Linux ld.so
checking how to hardcode library paths into programs... immediate
checking whether stripping libraries is possible... yes
checking if libtool supports shared libraries... yes
checking whether to build shared libraries... yes
checking whether to build static libraries... no
checking sys/dg_sys_info.h usability... no
checking sys/dg_sys_info.h presence... no
checking for sys/dg_sys_info.h... no
checking whether Solaris gcc optimization fix is necessary... no
checking that generated files are newer than configure... done
configure: creating ./config.status
config.status: creating Makefile
config.status: creating gcroots.pc
config.status: creating m4/Makefile
config.status: executing depfiles commands
config.status: executing libtool commands
config.status: executing default commands
+ make -j4
Making all in m4
make[1]: Entering directory '/builddir/build/BUILD/libgcroots-0.3.1/m4'
make[1]: Nothing to be done for 'all'.
make[1]: Leaving directory '/builddir/build/BUILD/libgcroots-0.3.1/m4'
make[1]: Entering directory '/builddir/build/BUILD/libgcroots-0.3.1'
/bin/sh ./libtool  --tag=CC   --mode=compile gcc -DPACKAGE_NAME=\"gcroots\" -DPACKAGE_TARNAME=\"libgcroots\" -DPACKAGE_VERSION=\"0.3.1\" -DPACKAGE_STRING=\"gcroots\ 0.3.1\" -DPACKAGE_BUGREPORT=\"sigscheme-ja@googlegroups.com\" -DPACKAGE_URL=\"\" -DPACKAGE=\"libgcroots\" -DVERSION=\"0.3.1\" -DSTDC_HEADERS=1 -DHAVE_SYS_TYPES_H=1 -DHAVE_SYS_STAT_H=1 -DHAVE_STDLIB_H=1 -DHAVE_STRING_H=1 -DHAVE_MEMORY_H=1 -DHAVE_STRINGS_H=1 -DHAVE_INTTYPES_H=1 -DHAVE_STDINT_H=1 -DHAVE_UNISTD_H=1 -DSIZEOF_VOID_P=8 -DALIGNOF_VOID_P=8 -DHAVE_GETCONTEXT=1 -DHAVE_DLFCN_H=1 -DLT_OBJDIR=\".libs/\" -DNO_EXECUTE_PERMISSION=1 -DALL_INTERIOR_POINTERS=1 -DSMALL_CONFIG=1   -I./include  -fexceptions -O2 -flto=auto -ffat-lto-objects -fexceptions -g -grecord-gcc-switches -pipe -Wall -Werror=format-security -Wp,-D_FORTIFY_SOURCE=2 -Wp,-D_GLIBCXX_ASSERTIONS -specs=/usr/lib/rpm/redhat/redhat-hardened-cc1 -fstack-protector-strong -specs=/usr/lib/rpm/redhat/redhat-annobin-cc1  -fasynchronous-unwind-tables -fstack-clash-protection -pedantic -Wchar-subscripts -Wmissing-declarations -Wredundant-decls -Wmissing-prototypes -Wnested-externs -Wpointer-arith -Wcast-align -Wsign-compare -c -o mark.lo mark.c
/bin/sh ./libtool  --tag=CC   --mode=compile gcc -DPACKAGE_NAME=\"gcroots\" -DPACKAGE_TARNAME=\"libgcroots\" -DPACKAGE_VERSION=\"0.3.1\" -DPACKAGE_STRING=\"gcroots\ 0.3.1\" -DPACKAGE_BUGREPORT=\"sigscheme-ja@googlegroups.com\" -DPACKAGE_URL=\"\" -DPACKAGE=\"libgcroots\" -DVERSION=\"0.3.1\" -DSTDC_HEADERS=1 -DHAVE_SYS_TYPES_H=1 -DHAVE_SYS_STAT_H=1 -DHAVE_STDLIB_H=1 -DHAVE_STRING_H=1 -DHAVE_MEMORY_H=1 -DHAVE_STRINGS_H=1 -DHAVE_INTTYPES_H=1 -DHAVE_STDINT_H=1 -DHAVE_UNISTD_H=1 -DSIZEOF_VOID_P=8 -DALIGNOF_VOID_P=8 -DHAVE_GETCONTEXT=1 -DHAVE_DLFCN_H=1 -DLT_OBJDIR=\".libs/\" -DNO_EXECUTE_PERMISSION=1 -DALL_INTERIOR_POINTERS=1 -DSMALL_CONFIG=1   -I./include  -fexceptions -O2 -flto=auto -ffat-lto-objects -fexceptions -g -grecord-gcc-switches -pipe -Wall -Werror=format-security -Wp,-D_FORTIFY_SOURCE=2 -Wp,-D_GLIBCXX_ASSERTIONS -specs=/usr/lib/rpm/redhat/redhat-hardened-cc1 -fstack-protector-strong -specs=/usr/lib/rpm/redhat/redhat-annobin-cc1  -fasynchronous-unwind-tables -fstack-clash-protection -pedantic -Wchar-subscripts -Wmissing-declarations -Wredundant-decls -Wmissing-prototypes -Wnested-externs -Wpointer-arith -Wcast-align -Wsign-compare -c -o gcroots.lo gcroots.c
/bin/sh ./libtool  --tag=CC   --mode=compile gcc -DPACKAGE_NAME=\"gcroots\" -DPACKAGE_TARNAME=\"libgcroots\" -DPACKAGE_VERSION=\"0.3.1\" -DPACKAGE_STRING=\"gcroots\ 0.3.1\" -DPACKAGE_BUGREPORT=\"sigscheme-ja@googlegroups.com\" -DPACKAGE_URL=\"\" -DPACKAGE=\"libgcroots\" -DVERSION=\"0.3.1\" -DSTDC_HEADERS=1 -DHAVE_SYS_TYPES_H=1 -DHAVE_SYS_STAT_H=1 -DHAVE_STDLIB_H=1 -DHAVE_STRING_H=1 -DHAVE_MEMORY_H=1 -DHAVE_STRINGS_H=1 -DHAVE_INTTYPES_H=1 -DHAVE_STDINT_H=1 -DHAVE_UNISTD_H=1 -DSIZEOF_VOID_P=8 -DALIGNOF_VOID_P=8 -DHAVE_GETCONTEXT=1 -DHAVE_DLFCN_H=1 -DLT_OBJDIR=\".libs/\" -DNO_EXECUTE_PERMISSION=1 -DALL_INTERIOR_POINTERS=1 -DSMALL_CONFIG=1   -I./include  -fexceptions -O2 -flto=auto -ffat-lto-objects -fexceptions -g -grecord-gcc-switches -pipe -Wall -Werror=format-security -Wp,-D_FORTIFY_SOURCE=2 -Wp,-D_GLIBCXX_ASSERTIONS -specs=/usr/lib/rpm/redhat/redhat-hardened-cc1 -fstack-protector-strong -specs=/usr/lib/rpm/redhat/redhat-annobin-cc1  -fasynchronous-unwind-tables -fstack-clash-protection -pedantic -Wchar-subscripts -Wmissing-declarations -Wredundant-decls -Wmissing-prototypes -Wnested-externs -Wpointer-arith -Wcast-align -Wsign-compare -c -o mach_dep.lo mach_dep.c
libtool: compile:  gcc -DPACKAGE_NAME=\"gcroots\" -DPACKAGE_TARNAME=\"libgcroots\" -DPACKAGE_VERSION=\"0.3.1\" "-DPACKAGE_STRING=\"gcroots 0.3.1\"" -DPACKAGE_BUGREPORT=\"sigscheme-ja@googlegroups.com\" -DPACKAGE_URL=\"\" -DPACKAGE=\"libgcroots\" -DVERSION=\"0.3.1\" -DSTDC_HEADERS=1 -DHAVE_SYS_TYPES_H=1 -DHAVE_SYS_STAT_H=1 -DHAVE_STDLIB_H=1 -DHAVE_STRING_H=1 -DHAVE_MEMORY_H=1 -DHAVE_STRINGS_H=1 -DHAVE_INTTYPES_H=1 -DHAVE_STDINT_H=1 -DHAVE_UNISTD_H=1 -DSIZEOF_VOID_P=8 -DALIGNOF_VOID_P=8 -DHAVE_GETCONTEXT=1 -DHAVE_DLFCN_H=1 -DLT_OBJDIR=\".libs/\" -DNO_EXECUTE_PERMISSION=1 -DALL_INTERIOR_POINTERS=1 -DSMALL_CONFIG=1 -I./include -fexceptions -O2 -flto=auto -ffat-lto-objects -fexceptions -g -grecord-gcc-switches -pipe -Wall -Werror=format-security -Wp,-D_FORTIFY_SOURCE=2 -Wp,-D_GLIBCXX_ASSERTIONS -specs=/usr/lib/rpm/redhat/redhat-hardened-cc1 -fstack-protector-strong -specs=/usr/lib/rpm/redhat/redhat-annobin-cc1 -fasynchronous-unwind-tables -fstack-clash-protection -pedantic -Wchar-subscripts -Wmissing-declarations -Wredundant-decls -Wmissing-prototypes -Wnested-externs -Wpointer-arith -Wcast-align -Wsign-compare -c mark.c  -fPIC -DPIC -o .libs/mark.o
libtool: compile:  gcc -DPACKAGE_NAME=\"gcroots\" -DPACKAGE_TARNAME=\"libgcroots\" -DPACKAGE_VERSION=\"0.3.1\" "-DPACKAGE_STRING=\"gcroots 0.3.1\"" -DPACKAGE_BUGREPORT=\"sigscheme-ja@googlegroups.com\" -DPACKAGE_URL=\"\" -DPACKAGE=\"libgcroots\" -DVERSION=\"0.3.1\" -DSTDC_HEADERS=1 -DHAVE_SYS_TYPES_H=1 -DHAVE_SYS_STAT_H=1 -DHAVE_STDLIB_H=1 -DHAVE_STRING_H=1 -DHAVE_MEMORY_H=1 -DHAVE_STRINGS_H=1 -DHAVE_INTTYPES_H=1 -DHAVE_STDINT_H=1 -DHAVE_UNISTD_H=1 -DSIZEOF_VOID_P=8 -DALIGNOF_VOID_P=8 -DHAVE_GETCONTEXT=1 -DHAVE_DLFCN_H=1 -DLT_OBJDIR=\".libs/\" -DNO_EXECUTE_PERMISSION=1 -DALL_INTERIOR_POINTERS=1 -DSMALL_CONFIG=1 -I./include -fexceptions -O2 -flto=auto -ffat-lto-objects -fexceptions -g -grecord-gcc-switches -pipe -Wall -Werror=format-security -Wp,-D_FORTIFY_SOURCE=2 -Wp,-D_GLIBCXX_ASSERTIONS -specs=/usr/lib/rpm/redhat/redhat-hardened-cc1 -fstack-protector-strong -specs=/usr/lib/rpm/redhat/redhat-annobin-cc1 -fasynchronous-unwind-tables -fstack-clash-protection -pedantic -Wchar-subscripts -Wmissing-declarations -Wredundant-decls -Wmissing-prototypes -Wnested-externs -Wpointer-arith -Wcast-align -Wsign-compare -c gcroots.c  -fPIC -DPIC -o .libs/gcroots.o
libtool: compile:  gcc -DPACKAGE_NAME=\"gcroots\" -DPACKAGE_TARNAME=\"libgcroots\" -DPACKAGE_VERSION=\"0.3.1\" "-DPACKAGE_STRING=\"gcroots 0.3.1\"" -DPACKAGE_BUGREPORT=\"sigscheme-ja@googlegroups.com\" -DPACKAGE_URL=\"\" -DPACKAGE=\"libgcroots\" -DVERSION=\"0.3.1\" -DSTDC_HEADERS=1 -DHAVE_SYS_TYPES_H=1 -DHAVE_SYS_STAT_H=1 -DHAVE_STDLIB_H=1 -DHAVE_STRING_H=1 -DHAVE_MEMORY_H=1 -DHAVE_STRINGS_H=1 -DHAVE_INTTYPES_H=1 -DHAVE_STDINT_H=1 -DHAVE_UNISTD_H=1 -DSIZEOF_VOID_P=8 -DALIGNOF_VOID_P=8 -DHAVE_GETCONTEXT=1 -DHAVE_DLFCN_H=1 -DLT_OBJDIR=\".libs/\" -DNO_EXECUTE_PERMISSION=1 -DALL_INTERIOR_POINTERS=1 -DSMALL_CONFIG=1 -I./include -fexceptions -O2 -flto=auto -ffat-lto-objects -fexceptions -g -grecord-gcc-switches -pipe -Wall -Werror=format-security -Wp,-D_FORTIFY_SOURCE=2 -Wp,-D_GLIBCXX_ASSERTIONS -specs=/usr/lib/rpm/redhat/redhat-hardened-cc1 -fstack-protector-strong -specs=/usr/lib/rpm/redhat/redhat-annobin-cc1 -fasynchronous-unwind-tables -fstack-clash-protection -pedantic -Wchar-subscripts -Wmissing-declarations -Wredundant-decls -Wmissing-prototypes -Wnested-externs -Wpointer-arith -Wcast-align -Wsign-compare -c mach_dep.c  -fPIC -DPIC -o .libs/mach_dep.o
In file included from ./include/private/gc_priv.h:68,
                 from mark.c:30:
./include/private/gcconfig.h:492:5: error: #error "The collector has not been ported to this machine/OS combination."
  492 | #   error "The collector has not been ported to this machine/OS combination."
      |     ^~~~~
In file included from ./include/private/gc_priv.h:68,
                 from gcroots.c:19:
./include/private/gcconfig.h:492:5: error: #error "The collector has not been ported to this machine/OS combination."
  492 | #   error "The collector has not been ported to this machine/OS combination."
      |     ^~~~~
mark.c: In function 'GCROOTS_noop1':
mark.c:35:26: warning: variable 'sink' set but not used [-Wunused-but-set-variable]
   35 |     static volatile word sink;
      |                          ^~~~
In file included from ./include/private/gc_priv.h:68,
                 from mach_dep.c:16:
./include/private/gcconfig.h:492:5: error: #error "The collector has not been ported to this machine/OS combination."
  492 | #   error "The collector has not been ported to this machine/OS combination."
      |     ^~~~~
make[1]: *** [Makefile:907: mark.lo] Error 1
make[1]: *** Waiting for unfinished jobs....
gcroots.c: In function 'GCROOTS_push_current_stack':
gcroots.c:196:11: warning: cast increases required alignment of target type [-Wcast-align]
  196 |     ctx = (GCROOTS_context *)cold_gc_frame;
      |           ^
make[1]: *** [Makefile:907: gcroots.lo] Error 1
make[1]: *** [Makefile:907: mach_dep.lo] Error 1
make[1]: Leaving directory '/builddir/build/BUILD/libgcroots-0.3.1'
make: *** [Makefile:994: all-recursive] Error 1
error: Bad exit status from /var/tmp/rpm-tmp.I21AZM (%build)
RPM build errors:
    Bad exit status from /var/tmp/rpm-tmp.I21AZM (%build)
Child return code was: 1
EXCEPTION: [Error()]
Traceback (most recent call last):
  File "/usr/lib/python3.8/site-packages/mockbuild/trace_decorator.py", line 95, in trace
    result = func(*args, **kw)
  File "/usr/lib/python3.8/site-packages/mockbuild/util.py", line 746, in do_with_status
    raise exception.Error("Command failed: \n # %s\n%s" % (command, output), child.returncode)
mockbuild.exception.Error: Command failed: 
 # bash --login -c /usr/bin/rpmbuild -bb --target riscv64 --nodeps /builddir/build/SPECS/libgcroots.spec