Mock Version: 1.4.21
Mock Version: 1.4.21
ENTER ['do_with_status'](['bash', '--login', '-c', '/usr/bin/rpmbuild -bs --target riscv64 --nodeps /builddir/build/SPECS/cscppc.spec'], chrootPath='/var/lib/mock/f33-build-472172-63759/root'env={'TERM': 'vt100', 'SHELL': '/bin/bash', 'HOME': '/builddir', 'HOSTNAME': 'mock', 'PATH': '/usr/bin:/bin:/usr/sbin:/sbin', 'PROMPT_COMMAND': 'printf "\\033]0;<mock-chroot>\\007"', 'PS1': '<mock-chroot> \\s-\\v\\$ ', 'LANG': 'en_US.UTF-8'}shell=Falselogger=<mockbuild.trace_decorator.getLog object at 0x3fda1bf700>timeout=432000uid=987gid=135user='mockbuild'nspawn_args=[]unshare_net=TrueprintOutput=False)
Executing command: ['bash', '--login', '-c', '/usr/bin/rpmbuild -bs --target riscv64 --nodeps /builddir/build/SPECS/cscppc.spec'] with env {'TERM': 'vt100', 'SHELL': '/bin/bash', 'HOME': '/builddir', 'HOSTNAME': 'mock', 'PATH': '/usr/bin:/bin:/usr/sbin:/sbin', 'PROMPT_COMMAND': 'printf "\\033]0;<mock-chroot>\\007"', 'PS1': '<mock-chroot> \\s-\\v\\$ ', 'LANG': 'en_US.UTF-8'} and shell False
Building target platforms: riscv64
Building for target riscv64
setting SOURCE_DATE_EPOCH=1603152000
Wrote: /builddir/build/SRPMS/cscppc-1.8.1-1.fc33.src.rpm
Child return code was: 0
ENTER ['do_with_status'](['bash', '--login', '-c', '/usr/bin/rpmbuild -bb --target riscv64 --nodeps /builddir/build/SPECS/cscppc.spec'], chrootPath='/var/lib/mock/f33-build-472172-63759/root'env={'TERM': 'vt100', 'SHELL': '/bin/bash', 'HOME': '/builddir', 'HOSTNAME': 'mock', 'PATH': '/usr/bin:/bin:/usr/sbin:/sbin', 'PROMPT_COMMAND': 'printf "\\033]0;<mock-chroot>\\007"', 'PS1': '<mock-chroot> \\s-\\v\\$ ', 'LANG': 'en_US.UTF-8'}shell=Falselogger=<mockbuild.trace_decorator.getLog object at 0x3fda1bf700>timeout=432000uid=987gid=135user='mockbuild'nspawn_args=[]unshare_net=TrueprintOutput=False)
Executing command: ['bash', '--login', '-c', '/usr/bin/rpmbuild -bb --target riscv64 --nodeps /builddir/build/SPECS/cscppc.spec'] with env {'TERM': 'vt100', 'SHELL': '/bin/bash', 'HOME': '/builddir', 'HOSTNAME': 'mock', 'PATH': '/usr/bin:/bin:/usr/sbin:/sbin', 'PROMPT_COMMAND': 'printf "\\033]0;<mock-chroot>\\007"', 'PS1': '<mock-chroot> \\s-\\v\\$ ', 'LANG': 'en_US.UTF-8'} and shell False
Building target platforms: riscv64
Building for target riscv64
setting SOURCE_DATE_EPOCH=1603152000
Executing(%prep): /bin/sh -e /var/tmp/rpm-tmp.S6hYWW
+ umask 022
+ cd /builddir/build/BUILD
+ cd /builddir/build/BUILD
+ rm -rf cscppc-1.8.1
+ /usr/bin/xz -dc /builddir/build/SOURCES/cscppc-1.8.1.tar.xz
+ /usr/bin/tar -xof -
+ STATUS=0
+ '[' 0 -ne 0 ']'
+ cd cscppc-1.8.1
+ /usr/bin/chmod -Rf a+rX,u+w,g-w,o-w .
+ RPM_EC=0
++ jobs -p
+ exit 0
Executing(%build): /bin/sh -e /var/tmp/rpm-tmp.6oobXS
+ umask 022
+ cd /builddir/build/BUILD
+ cd cscppc-1.8.1
+ export 'CFLAGS=-O2 -flto=auto -ffat-lto-objects -fexceptions -g -grecord-gcc-switches -pipe -Wall -Werror=format-security -Wp,-D_FORTIFY_SOURCE=2 -Wp,-D_GLIBCXX_ASSERTIONS -specs=/usr/lib/rpm/redhat/redhat-hardened-cc1 -fstack-protector-strong -specs=/usr/lib/rpm/redhat/redhat-annobin-cc1  -fasynchronous-unwind-tables -fstack-clash-protection'
+ CFLAGS='-O2 -flto=auto -ffat-lto-objects -fexceptions -g -grecord-gcc-switches -pipe -Wall -Werror=format-security -Wp,-D_FORTIFY_SOURCE=2 -Wp,-D_GLIBCXX_ASSERTIONS -specs=/usr/lib/rpm/redhat/redhat-hardened-cc1 -fstack-protector-strong -specs=/usr/lib/rpm/redhat/redhat-annobin-cc1  -fasynchronous-unwind-tables -fstack-clash-protection'
+ CFLAGS='-O2 -flto=auto -ffat-lto-objects -fexceptions -g -grecord-gcc-switches -pipe -Wall -Werror=format-security -Wp,-D_FORTIFY_SOURCE=2 -Wp,-D_GLIBCXX_ASSERTIONS -specs=/usr/lib/rpm/redhat/redhat-hardened-cc1 -fstack-protector-strong -specs=/usr/lib/rpm/redhat/redhat-annobin-cc1  -fasynchronous-unwind-tables -fstack-clash-protection -DPATH_TO_CSCPPC=\"/usr/lib64/cscppc\"'
+ CFLAGS='-O2 -flto=auto -ffat-lto-objects -fexceptions -g -grecord-gcc-switches -pipe -Wall -Werror=format-security -Wp,-D_FORTIFY_SOURCE=2 -Wp,-D_GLIBCXX_ASSERTIONS -specs=/usr/lib/rpm/redhat/redhat-hardened-cc1 -fstack-protector-strong -specs=/usr/lib/rpm/redhat/redhat-annobin-cc1  -fasynchronous-unwind-tables -fstack-clash-protection -DPATH_TO_CSCPPC=\"/usr/lib64/cscppc\" -DPATH_TO_CSCLNG=\"/usr/lib64/csclng\"'
+ CFLAGS='-O2 -flto=auto -ffat-lto-objects -fexceptions -g -grecord-gcc-switches -pipe -Wall -Werror=format-security -Wp,-D_FORTIFY_SOURCE=2 -Wp,-D_GLIBCXX_ASSERTIONS -specs=/usr/lib/rpm/redhat/redhat-hardened-cc1 -fstack-protector-strong -specs=/usr/lib/rpm/redhat/redhat-annobin-cc1  -fasynchronous-unwind-tables -fstack-clash-protection -DPATH_TO_CSCPPC=\"/usr/lib64/cscppc\" -DPATH_TO_CSCLNG=\"/usr/lib64/csclng\" -DPATH_TO_CSGCCA=\"/usr/lib64/csgcca\"'
+ CFLAGS='-O2 -flto=auto -ffat-lto-objects -fexceptions -g -grecord-gcc-switches -pipe -Wall -Werror=format-security -Wp,-D_FORTIFY_SOURCE=2 -Wp,-D_GLIBCXX_ASSERTIONS -specs=/usr/lib/rpm/redhat/redhat-hardened-cc1 -fstack-protector-strong -specs=/usr/lib/rpm/redhat/redhat-annobin-cc1  -fasynchronous-unwind-tables -fstack-clash-protection -DPATH_TO_CSCPPC=\"/usr/lib64/cscppc\" -DPATH_TO_CSCLNG=\"/usr/lib64/csclng\" -DPATH_TO_CSGCCA=\"/usr/lib64/csgcca\" -DPATH_TO_CSMATCH=\"/usr/lib64/csmatch\"'
+ export 'LDFLAGS=-O2 -flto=auto -ffat-lto-objects -fexceptions -g -grecord-gcc-switches -pipe -Wall -Werror=format-security -Wp,-D_FORTIFY_SOURCE=2 -Wp,-D_GLIBCXX_ASSERTIONS -specs=/usr/lib/rpm/redhat/redhat-hardened-cc1 -fstack-protector-strong -specs=/usr/lib/rpm/redhat/redhat-annobin-cc1  -fasynchronous-unwind-tables -fstack-clash-protection -static -pthread'
+ LDFLAGS='-O2 -flto=auto -ffat-lto-objects -fexceptions -g -grecord-gcc-switches -pipe -Wall -Werror=format-security -Wp,-D_FORTIFY_SOURCE=2 -Wp,-D_GLIBCXX_ASSERTIONS -specs=/usr/lib/rpm/redhat/redhat-hardened-cc1 -fstack-protector-strong -specs=/usr/lib/rpm/redhat/redhat-annobin-cc1  -fasynchronous-unwind-tables -fstack-clash-protection -static -pthread'
+ CFLAGS='-O2 -flto=auto -ffat-lto-objects -fexceptions -g -grecord-gcc-switches -pipe -Wall -Werror=format-security -Wp,-D_FORTIFY_SOURCE=2 -Wp,-D_GLIBCXX_ASSERTIONS -specs=/usr/lib/rpm/redhat/redhat-hardened-cc1 -fstack-protector-strong -specs=/usr/lib/rpm/redhat/redhat-annobin-cc1  -fasynchronous-unwind-tables -fstack-clash-protection -DPATH_TO_CSCPPC=\"/usr/lib64/cscppc\" -DPATH_TO_CSCLNG=\"/usr/lib64/csclng\" -DPATH_TO_CSGCCA=\"/usr/lib64/csgcca\" -DPATH_TO_CSMATCH=\"/usr/lib64/csmatch\"'
+ export CFLAGS
+ CXXFLAGS='-O2 -flto=auto -ffat-lto-objects -fexceptions -g -grecord-gcc-switches -pipe -Wall -Werror=format-security -Wp,-D_FORTIFY_SOURCE=2 -Wp,-D_GLIBCXX_ASSERTIONS -specs=/usr/lib/rpm/redhat/redhat-hardened-cc1 -fstack-protector-strong -specs=/usr/lib/rpm/redhat/redhat-annobin-cc1  -fasynchronous-unwind-tables -fstack-clash-protection'
+ export CXXFLAGS
+ FFLAGS='-O2 -flto=auto -ffat-lto-objects -fexceptions -g -grecord-gcc-switches -pipe -Wall -Werror=format-security -Wp,-D_FORTIFY_SOURCE=2 -Wp,-D_GLIBCXX_ASSERTIONS -specs=/usr/lib/rpm/redhat/redhat-hardened-cc1 -fstack-protector-strong -specs=/usr/lib/rpm/redhat/redhat-annobin-cc1  -fasynchronous-unwind-tables -fstack-clash-protection -I/usr/lib64/gfortran/modules'
+ export FFLAGS
+ FCFLAGS='-O2 -flto=auto -ffat-lto-objects -fexceptions -g -grecord-gcc-switches -pipe -Wall -Werror=format-security -Wp,-D_FORTIFY_SOURCE=2 -Wp,-D_GLIBCXX_ASSERTIONS -specs=/usr/lib/rpm/redhat/redhat-hardened-cc1 -fstack-protector-strong -specs=/usr/lib/rpm/redhat/redhat-annobin-cc1  -fasynchronous-unwind-tables -fstack-clash-protection -I/usr/lib64/gfortran/modules'
+ export FCFLAGS
+ LDFLAGS='-O2 -flto=auto -ffat-lto-objects -fexceptions -g -grecord-gcc-switches -pipe -Wall -Werror=format-security -Wp,-D_FORTIFY_SOURCE=2 -Wp,-D_GLIBCXX_ASSERTIONS -specs=/usr/lib/rpm/redhat/redhat-hardened-cc1 -fstack-protector-strong -specs=/usr/lib/rpm/redhat/redhat-annobin-cc1  -fasynchronous-unwind-tables -fstack-clash-protection -static -pthread'
+ export LDFLAGS
+ LT_SYS_LIBRARY_PATH=/usr/lib64:
+ export LT_SYS_LIBRARY_PATH
+ CC=gcc
+ export CC
+ CXX=g++
+ export CXX
+ /usr/bin/cmake -S . -B riscv64-redhat-linux-gnu -DCMAKE_C_FLAGS_RELEASE:STRING=-DNDEBUG -DCMAKE_CXX_FLAGS_RELEASE:STRING=-DNDEBUG -DCMAKE_Fortran_FLAGS_RELEASE:STRING=-DNDEBUG -DCMAKE_VERBOSE_MAKEFILE:BOOL=ON -DCMAKE_INSTALL_PREFIX:PATH=/usr -DINCLUDE_INSTALL_DIR:PATH=/usr/include -DLIB_INSTALL_DIR:PATH=/usr/lib64 -DSYSCONF_INSTALL_DIR:PATH=/etc -DSHARE_INSTALL_PREFIX:PATH=/usr/share -DLIB_SUFFIX=64 -DBUILD_SHARED_LIBS:BOOL=ON
-- The C compiler identification is GNU 10.2.1
-- Detecting C compiler ABI info
-- Detecting C compiler ABI info - failed
-- Check for working C compiler: /usr/bin/gcc
-- Check for working C compiler: /usr/bin/gcc - broken
CMake Error at /usr/share/cmake/Modules/CMakeTestCCompiler.cmake:66 (message):
  The C compiler
    "/usr/bin/gcc"
  is not able to compile a simple test program.
  It fails with the following output:
    Change Dir: /builddir/build/BUILD/cscppc-1.8.1/riscv64-redhat-linux-gnu/CMakeFiles/CMakeTmp
    
    Run Build Command(s):/usr/bin/gmake cmTC_6d3d1/fast && /usr/bin/gmake  -f CMakeFiles/cmTC_6d3d1.dir/build.make CMakeFiles/cmTC_6d3d1.dir/build
    gmake[1]: Entering directory '/builddir/build/BUILD/cscppc-1.8.1/riscv64-redhat-linux-gnu/CMakeFiles/CMakeTmp'
    Building C object CMakeFiles/cmTC_6d3d1.dir/testCCompiler.c.o
    /usr/bin/gcc   -O2 -flto=auto -ffat-lto-objects -fexceptions -g -grecord-gcc-switches -pipe -Wall -Werror=format-security -Wp,-D_FORTIFY_SOURCE=2 -Wp,-D_GLIBCXX_ASSERTIONS -specs=/usr/lib/rpm/redhat/redhat-hardened-cc1 -fstack-protector-strong -specs=/usr/lib/rpm/redhat/redhat-annobin-cc1  -fasynchronous-unwind-tables -fstack-clash-protection -DPATH_TO_CSCPPC=\"/usr/lib64/cscppc\" -DPATH_TO_CSCLNG=\"/usr/lib64/csclng\" -DPATH_TO_CSGCCA=\"/usr/lib64/csgcca\" -DPATH_TO_CSMATCH=\"/usr/lib64/csmatch\"  -o CMakeFiles/cmTC_6d3d1.dir/testCCompiler.c.o -c /builddir/build/BUILD/cscppc-1.8.1/riscv64-redhat-linux-gnu/CMakeFiles/CMakeTmp/testCCompiler.c
    Linking C executable cmTC_6d3d1
    /usr/bin/cmake -E cmake_link_script CMakeFiles/cmTC_6d3d1.dir/link.txt --verbose=1
    /usr/bin/gcc -O2 -flto=auto -ffat-lto-objects -fexceptions -g -grecord-gcc-switches -pipe -Wall -Werror=format-security -Wp,-D_FORTIFY_SOURCE=2 -Wp,-D_GLIBCXX_ASSERTIONS -specs=/usr/lib/rpm/redhat/redhat-hardened-cc1 -fstack-protector-strong -specs=/usr/lib/rpm/redhat/redhat-annobin-cc1  -fasynchronous-unwind-tables -fstack-clash-protection -DPATH_TO_CSCPPC=\"/usr/lib64/cscppc\" -DPATH_TO_CSCLNG=\"/usr/lib64/csclng\" -DPATH_TO_CSGCCA=\"/usr/lib64/csgcca\" -DPATH_TO_CSMATCH=\"/usr/lib64/csmatch\"  -O2 -flto=auto -ffat-lto-objects -fexceptions -g -grecord-gcc-switches -pipe -Wall -Werror=format-security -Wp,-D_FORTIFY_SOURCE=2 -Wp,-D_GLIBCXX_ASSERTIONS -specs=/usr/lib/rpm/redhat/redhat-hardened-cc1 -fstack-protector-strong -specs=/usr/lib/rpm/redhat/redhat-annobin-cc1  -fasynchronous-unwind-tables -fstack-clash-protection -static -pthread  -rdynamic CMakeFiles/cmTC_6d3d1.dir/testCCompiler.c.o -o cmTC_6d3d1 
    /usr/bin/ld: cannot find -latomic
    collect2: error: ld returned 1 exit status
    gmake[1]: *** [CMakeFiles/cmTC_6d3d1.dir/build.make:106: cmTC_6d3d1] Error 1
    gmake[1]: Leaving directory '/builddir/build/BUILD/cscppc-1.8.1/riscv64-redhat-linux-gnu/CMakeFiles/CMakeTmp'
    gmake: *** [Makefile:140: cmTC_6d3d1/fast] Error 2
    
    
  
  CMake will not be able to correctly generate this project.
Call Stack (most recent call first):
  CMakeLists.txt:19 (project)
-- Configuring incomplete, errors occurred!
See also "/builddir/build/BUILD/cscppc-1.8.1/riscv64-redhat-linux-gnu/CMakeFiles/CMakeOutput.log".
See also "/builddir/build/BUILD/cscppc-1.8.1/riscv64-redhat-linux-gnu/CMakeFiles/CMakeError.log".
RPM build errors:
error: Bad exit status from /var/tmp/rpm-tmp.6oobXS (%build)
    Bad exit status from /var/tmp/rpm-tmp.6oobXS (%build)
Child return code was: 1
EXCEPTION: [Error()]
Traceback (most recent call last):
  File "/usr/lib/python3.8/site-packages/mockbuild/trace_decorator.py", line 95, in trace
    result = func(*args, **kw)
  File "/usr/lib/python3.8/site-packages/mockbuild/util.py", line 746, in do_with_status
    raise exception.Error("Command failed: \n # %s\n%s" % (command, output), child.returncode)
mockbuild.exception.Error: Command failed: 
 # bash --login -c /usr/bin/rpmbuild -bb --target riscv64 --nodeps /builddir/build/SPECS/cscppc.spec