Mock Version: 1.4.14
Mock Version: 1.4.14
ENTER ['do'](['bash', '--login', '-c', '/usr/bin/rpmbuild -bs --target riscv64 --nodeps /builddir/build/SPECS/kcov.spec'], chrootPath='/var/lib/mock/f31-build-91430-32303/root'env={'TERM': 'vt100', 'SHELL': '/bin/bash', 'HOME': '/builddir', 'HOSTNAME': 'mock', 'PATH': '/usr/bin:/bin:/usr/sbin:/sbin', 'PROMPT_COMMAND': 'printf "\\033]0;<mock-chroot>\\007"', 'PS1': '<mock-chroot> \\s-\\v\\$ ', 'LANG': 'en_US.UTF-8'}shell=Falselogger=<mockbuild.trace_decorator.getLog object at 0x15580c0a90>timeout=345600uid=986gid=135user='mockbuild'nspawn_args=[]unshare_net=TrueprintOutput=False)
Executing command: ['bash', '--login', '-c', '/usr/bin/rpmbuild -bs --target riscv64 --nodeps /builddir/build/SPECS/kcov.spec'] with env {'TERM': 'vt100', 'SHELL': '/bin/bash', 'HOME': '/builddir', 'HOSTNAME': 'mock', 'PATH': '/usr/bin:/bin:/usr/sbin:/sbin', 'PROMPT_COMMAND': 'printf "\\033]0;<mock-chroot>\\007"', 'PS1': '<mock-chroot> \\s-\\v\\$ ', 'LANG': 'en_US.UTF-8'} and shell False
Building target platforms: riscv64
Building for target riscv64
setting SOURCE_DATE_EPOCH=1565308800
Wrote: /builddir/build/SRPMS/kcov-36-2.fc31.src.rpm
Child return code was: 0
ENTER ['do'](['bash', '--login', '-c', '/usr/bin/rpmbuild -bb --target riscv64 --nodeps /builddir/build/SPECS/kcov.spec'], chrootPath='/var/lib/mock/f31-build-91430-32303/root'env={'TERM': 'vt100', 'SHELL': '/bin/bash', 'HOME': '/builddir', 'HOSTNAME': 'mock', 'PATH': '/usr/bin:/bin:/usr/sbin:/sbin', 'PROMPT_COMMAND': 'printf "\\033]0;<mock-chroot>\\007"', 'PS1': '<mock-chroot> \\s-\\v\\$ ', 'LANG': 'en_US.UTF-8'}shell=Falselogger=<mockbuild.trace_decorator.getLog object at 0x15580c0a90>timeout=345600uid=986gid=135user='mockbuild'nspawn_args=[]unshare_net=TrueprintOutput=False)
Executing command: ['bash', '--login', '-c', '/usr/bin/rpmbuild -bb --target riscv64 --nodeps /builddir/build/SPECS/kcov.spec'] with env {'TERM': 'vt100', 'SHELL': '/bin/bash', 'HOME': '/builddir', 'HOSTNAME': 'mock', 'PATH': '/usr/bin:/bin:/usr/sbin:/sbin', 'PROMPT_COMMAND': 'printf "\\033]0;<mock-chroot>\\007"', 'PS1': '<mock-chroot> \\s-\\v\\$ ', 'LANG': 'en_US.UTF-8'} and shell False
Building target platforms: riscv64
Building for target riscv64
setting SOURCE_DATE_EPOCH=1565308800
Executing(%prep): /bin/sh -e /var/tmp/rpm-tmp.TJZYAn
+ umask 022
+ cd /builddir/build/BUILD
+ cd /builddir/build/BUILD
+ rm -rf kcov-36
+ /usr/bin/gzip -dc /builddir/build/SOURCES/kcov-36.tar.gz
+ /usr/bin/tar -xof -
+ STATUS=0
+ '[' 0 -ne 0 ']'
+ cd kcov-36
+ /usr/bin/chmod -Rf a+rX,u+w,g-w,o-w .
+ rm -frv external/
BUILDSTDERR: ++ grep -lr '#!/usr/bin/env python$' src tests
+ sed -i 's:#!/usr/bin/env python:#!/usr/bin/env python2:' src/engines/python-helper.py src/bin-to-c-source.py tests/multi-fork/generate-functions.py tests/tools/testbase.py tests/tools/parse_cobertura.py tests/tools/run-tests tests/python/main
+ RPM_EC=0
BUILDSTDERR: ++ jobs -p
+ exit 0
removed 'external/lldb/include/lldb/lldb-defines.h'
removed 'external/lldb/include/lldb/Utility/SharingPtr.h'
removed directory 'external/lldb/include/lldb/Utility'
removed 'external/lldb/include/lldb/lldb-versioning.h'
removed 'external/lldb/include/lldb/API/SBHostOS.h'
removed 'external/lldb/include/lldb/API/SystemInitializerFull.h'
removed 'external/lldb/include/lldb/API/SBListener.h'
removed 'external/lldb/include/lldb/API/SBTypeNameSpecifier.h'
removed 'external/lldb/include/lldb/API/SBCommunication.h'
removed 'external/lldb/include/lldb/API/SBUnixSignals.h'
removed 'external/lldb/include/lldb/API/SBDefines.h'
removed 'external/lldb/include/lldb/API/SBBroadcaster.h'
removed 'external/lldb/include/lldb/API/SBAddress.h'
removed 'external/lldb/include/lldb/API/SBExecutionContext.h'
removed 'external/lldb/include/lldb/API/SBAttachInfo.h'
removed 'external/lldb/include/lldb/API/SBTypeFilter.h'
removed 'external/lldb/include/lldb/API/SBEvent.h'
removed 'external/lldb/include/lldb/API/SBSourceManager.h'
removed 'external/lldb/include/lldb/API/SBExpressionOptions.h'
removed 'external/lldb/include/lldb/API/SBSection.h'
removed 'external/lldb/include/lldb/API/SBFileSpecList.h'
removed 'external/lldb/include/lldb/API/SBSymbol.h'
removed 'external/lldb/include/lldb/API/SBThread.h'
removed 'external/lldb/include/lldb/API/SBSymbolContextList.h'
removed 'external/lldb/include/lldb/API/SBTypeFormat.h'
removed 'external/lldb/include/lldb/API/SBFileSpec.h'
removed 'external/lldb/include/lldb/API/SBThreadPlan.h'
removed 'external/lldb/include/lldb/API/SBSymbolContext.h'
removed 'external/lldb/include/lldb/API/SBBreakpoint.h'
removed 'external/lldb/include/lldb/API/SBValueList.h'
removed 'external/lldb/include/lldb/API/SBThreadCollection.h'
removed 'external/lldb/include/lldb/API/SBLaunchInfo.h'
removed 'external/lldb/include/lldb/API/SBLineEntry.h'
removed 'external/lldb/include/lldb/API/SBDeclaration.h'
removed 'external/lldb/include/lldb/API/SBBreakpointLocation.h'
removed 'external/lldb/include/lldb/API/SBDebugger.h'
removed 'external/lldb/include/lldb/API/SBTypeSummary.h'
removed 'external/lldb/include/lldb/API/SBQueueItem.h'
removed 'external/lldb/include/lldb/API/SBValue.h'
removed 'external/lldb/include/lldb/API/SBTypeEnumMember.h'
removed 'external/lldb/include/lldb/API/SBFrame.h'
removed 'external/lldb/include/lldb/API/SBData.h'
removed 'external/lldb/include/lldb/API/SBInstructionList.h'
removed 'external/lldb/include/lldb/API/SBFunction.h'
removed 'external/lldb/include/lldb/API/SBTypeSynthetic.h'
removed 'external/lldb/include/lldb/API/SBStream.h'
removed 'external/lldb/include/lldb/API/SBProcess.h'
removed 'external/lldb/include/lldb/API/SBPlatform.h'
removed 'external/lldb/include/lldb/API/SBVariablesOptions.h'
removed 'external/lldb/include/lldb/API/SBWatchpoint.h'
removed 'external/lldb/include/lldb/API/SBModuleSpec.h'
removed 'external/lldb/include/lldb/API/SBStringList.h'
removed 'external/lldb/include/lldb/API/SBTypeCategory.h'
removed 'external/lldb/include/lldb/API/LLDB.h'
removed 'external/lldb/include/lldb/API/SBTarget.h'
removed 'external/lldb/include/lldb/API/SBType.h'
removed 'external/lldb/include/lldb/API/SBQueue.h'
removed 'external/lldb/include/lldb/API/SBModule.h'
removed 'external/lldb/include/lldb/API/SBLanguageRuntime.h'
removed 'external/lldb/include/lldb/API/SBBlock.h'
removed 'external/lldb/include/lldb/API/SBCommandInterpreter.h'
removed 'external/lldb/include/lldb/API/SBCompileUnit.h'
removed 'external/lldb/include/lldb/API/SBCommandReturnObject.h'
removed 'external/lldb/include/lldb/API/SBInstruction.h'
removed 'external/lldb/include/lldb/API/SBError.h'
removed directory 'external/lldb/include/lldb/API'
removed 'external/lldb/include/lldb/lldb-forward.h'
removed 'external/lldb/include/lldb/lldb-enumerations.h'
removed 'external/lldb/include/lldb/lldb-types.h'
removed directory 'external/lldb/include/lldb'
removed directory 'external/lldb/include'
removed directory 'external/lldb'
removed directory 'external/'
Executing(%build): /bin/sh -e /var/tmp/rpm-tmp.xDkzxm
+ umask 022
+ cd /builddir/build/BUILD
+ cd kcov-36
+ cmake -S tools -B build-tools -DCMAKE_VERBOSE_MAKEFILE:BOOL=ON
+ /usr/bin/make -O -j4 V=1 VERBOSE=1 -C build-tools
-- The C compiler identification is GNU 9.1.1
-- The CXX compiler identification is GNU 9.1.1
-- Check for working C compiler: /usr/bin/cc
-- Check for working C compiler: /usr/bin/cc -- works
-- Detecting C compiler ABI info
-- Detecting C compiler ABI info - done
-- Detecting C compile features
-- Detecting C compile features - done
-- Check for working CXX compiler: /usr/bin/c++
-- Check for working CXX compiler: /usr/bin/c++ -- works
-- Detecting CXX compiler ABI info
-- Detecting CXX compiler ABI info - done
-- Detecting CXX compile features
-- Detecting CXX compile features - done
-- Found LibElf: /usr/lib64/libelf.so  
-- Found ElfUtils: /usr/lib64/libdw.so  
-- Found PkgConfig: /usr/bin/pkg-config (found version "1.6.3") 
-- Looking for pthread.h
-- Looking for pthread.h - found
-- Looking for pthread_create
-- Looking for pthread_create - not found
-- Looking for pthread_create in pthreads
-- Looking for pthread_create in pthreads - not found
-- Looking for pthread_create in pthread
-- Looking for pthread_create in pthread - found
-- Found Threads: TRUE  
-- Found ZLIB: /usr/lib64/libz.so (found version "1.2.11") 
-- Found DL: /usr/lib64/libdl.so
-- Found M: /usr/lib64/libm.so
-- Configuring done
-- Generating done
-- Build files have been written to: /builddir/build/BUILD/kcov-36/build-tools
make: Entering directory '/builddir/build/BUILD/kcov-36/build-tools'
/usr/bin/cmake -S/builddir/build/BUILD/kcov-36/tools -B/builddir/build/BUILD/kcov-36/build-tools --check-build-system CMakeFiles/Makefile.cmake 0
make: Leaving directory '/builddir/build/BUILD/kcov-36/build-tools'
make: Entering directory '/builddir/build/BUILD/kcov-36/build-tools'
/usr/bin/cmake -E cmake_progress_start /builddir/build/BUILD/kcov-36/build-tools/CMakeFiles /builddir/build/BUILD/kcov-36/build-tools/CMakeFiles/progress.marks
make: Leaving directory '/builddir/build/BUILD/kcov-36/build-tools'
/usr/bin/make -f CMakeFiles/Makefile2 all
/usr/bin/make -f CMakeFiles/line2addr.dir/build.make CMakeFiles/line2addr.dir/depend
make[2]: Entering directory '/builddir/build/BUILD/kcov-36/build-tools'
cd /builddir/build/BUILD/kcov-36/build-tools && /usr/bin/cmake -E cmake_depends "Unix Makefiles" /builddir/build/BUILD/kcov-36/tools /builddir/build/BUILD/kcov-36/tools /builddir/build/BUILD/kcov-36/build-tools /builddir/build/BUILD/kcov-36/build-tools /builddir/build/BUILD/kcov-36/build-tools/CMakeFiles/line2addr.dir/DependInfo.cmake --color=
Dependee "/builddir/build/BUILD/kcov-36/build-tools/CMakeFiles/line2addr.dir/DependInfo.cmake" is newer than depender "/builddir/build/BUILD/kcov-36/build-tools/CMakeFiles/line2addr.dir/depend.internal".
Dependee "/builddir/build/BUILD/kcov-36/build-tools/CMakeFiles/CMakeDirectoryInformation.cmake" is newer than depender "/builddir/build/BUILD/kcov-36/build-tools/CMakeFiles/line2addr.dir/depend.internal".
Scanning dependencies of target line2addr
make[2]: Leaving directory '/builddir/build/BUILD/kcov-36/build-tools'
/usr/bin/make -f CMakeFiles/line2addr.dir/build.make CMakeFiles/line2addr.dir/build
make[2]: Entering directory '/builddir/build/BUILD/kcov-36/build-tools'
[ 33%] Building CXX object CMakeFiles/line2addr.dir/builddir/build/BUILD/kcov-36/src/filter.cc.o
/usr/bin/c++   -I/builddir/build/BUILD/kcov-36/tools/../src/include  -std=c++0x -g -Wall -D_GLIBCXX_USE_NANOSLEEP -DKCOV_LIBRARY_PREFIX=   -o CMakeFiles/line2addr.dir/builddir/build/BUILD/kcov-36/src/filter.cc.o -c /builddir/build/BUILD/kcov-36/src/filter.cc
make[2]: Leaving directory '/builddir/build/BUILD/kcov-36/build-tools'
make[2]: Entering directory '/builddir/build/BUILD/kcov-36/build-tools'
[ 16%] Building CXX object CMakeFiles/line2addr.dir/builddir/build/BUILD/kcov-36/src/capabilities.cc.o
/usr/bin/c++   -I/builddir/build/BUILD/kcov-36/tools/../src/include  -std=c++0x -g -Wall -D_GLIBCXX_USE_NANOSLEEP -DKCOV_LIBRARY_PREFIX=   -o CMakeFiles/line2addr.dir/builddir/build/BUILD/kcov-36/src/capabilities.cc.o -c /builddir/build/BUILD/kcov-36/src/capabilities.cc
make[2]: Leaving directory '/builddir/build/BUILD/kcov-36/build-tools'
make[2]: Entering directory '/builddir/build/BUILD/kcov-36/build-tools'
[ 41%] Building CXX object CMakeFiles/line2addr.dir/builddir/build/BUILD/kcov-36/src/parsers/dwarf.cc.o
/usr/bin/c++   -I/builddir/build/BUILD/kcov-36/tools/../src/include  -std=c++0x -g -Wall -D_GLIBCXX_USE_NANOSLEEP -DKCOV_LIBRARY_PREFIX=   -o CMakeFiles/line2addr.dir/builddir/build/BUILD/kcov-36/src/parsers/dwarf.cc.o -c /builddir/build/BUILD/kcov-36/src/parsers/dwarf.cc
make[2]: Leaving directory '/builddir/build/BUILD/kcov-36/build-tools'
make[2]: Entering directory '/builddir/build/BUILD/kcov-36/build-tools'
[  8%] Building CXX object CMakeFiles/line2addr.dir/builddir/build/BUILD/kcov-36/src/gcov.cc.o
/usr/bin/c++   -I/builddir/build/BUILD/kcov-36/tools/../src/include  -std=c++0x -g -Wall -D_GLIBCXX_USE_NANOSLEEP -DKCOV_LIBRARY_PREFIX=   -o CMakeFiles/line2addr.dir/builddir/build/BUILD/kcov-36/src/gcov.cc.o -c /builddir/build/BUILD/kcov-36/src/gcov.cc
make[2]: Leaving directory '/builddir/build/BUILD/kcov-36/build-tools'
make[2]: Entering directory '/builddir/build/BUILD/kcov-36/build-tools'
[ 66%] Building CXX object CMakeFiles/line2addr.dir/builddir/build/BUILD/kcov-36/src/parsers/dummy-disassembler.cc.o
/usr/bin/c++   -I/builddir/build/BUILD/kcov-36/tools/../src/include  -std=c++0x -g -Wall -D_GLIBCXX_USE_NANOSLEEP -DKCOV_LIBRARY_PREFIX=   -o CMakeFiles/line2addr.dir/builddir/build/BUILD/kcov-36/src/parsers/dummy-disassembler.cc.o -c /builddir/build/BUILD/kcov-36/src/parsers/dummy-disassembler.cc
make[2]: Leaving directory '/builddir/build/BUILD/kcov-36/build-tools'
make[2]: Entering directory '/builddir/build/BUILD/kcov-36/build-tools'
[ 33%] Building CXX object CMakeFiles/line2addr.dir/builddir/build/BUILD/kcov-36/src/configuration.cc.o
/usr/bin/c++   -I/builddir/build/BUILD/kcov-36/tools/../src/include  -std=c++0x -g -Wall -D_GLIBCXX_USE_NANOSLEEP -DKCOV_LIBRARY_PREFIX=   -o CMakeFiles/line2addr.dir/builddir/build/BUILD/kcov-36/src/configuration.cc.o -c /builddir/build/BUILD/kcov-36/src/configuration.cc
make[2]: Leaving directory '/builddir/build/BUILD/kcov-36/build-tools'
make[2]: Entering directory '/builddir/build/BUILD/kcov-36/build-tools'
[ 58%] Building CXX object CMakeFiles/line2addr.dir/builddir/build/BUILD/kcov-36/src/parsers/elf.cc.o
/usr/bin/c++   -I/builddir/build/BUILD/kcov-36/tools/../src/include  -std=c++0x -g -Wall -D_GLIBCXX_USE_NANOSLEEP -DKCOV_LIBRARY_PREFIX=   -o CMakeFiles/line2addr.dir/builddir/build/BUILD/kcov-36/src/parsers/elf.cc.o -c /builddir/build/BUILD/kcov-36/src/parsers/elf.cc
make[2]: Leaving directory '/builddir/build/BUILD/kcov-36/build-tools'
make[2]: Entering directory '/builddir/build/BUILD/kcov-36/build-tools'
[ 75%] Building CXX object CMakeFiles/line2addr.dir/builddir/build/BUILD/kcov-36/src/parser-manager.cc.o
/usr/bin/c++   -I/builddir/build/BUILD/kcov-36/tools/../src/include  -std=c++0x -g -Wall -D_GLIBCXX_USE_NANOSLEEP -DKCOV_LIBRARY_PREFIX=   -o CMakeFiles/line2addr.dir/builddir/build/BUILD/kcov-36/src/parser-manager.cc.o -c /builddir/build/BUILD/kcov-36/src/parser-manager.cc
make[2]: Leaving directory '/builddir/build/BUILD/kcov-36/build-tools'
make[2]: Entering directory '/builddir/build/BUILD/kcov-36/build-tools'
[ 50%] Building CXX object CMakeFiles/line2addr.dir/builddir/build/BUILD/kcov-36/src/parsers/elf-parser.cc.o
/usr/bin/c++   -I/builddir/build/BUILD/kcov-36/tools/../src/include  -std=c++0x -g -Wall -D_GLIBCXX_USE_NANOSLEEP -DKCOV_LIBRARY_PREFIX=   -o CMakeFiles/line2addr.dir/builddir/build/BUILD/kcov-36/src/parsers/elf-parser.cc.o -c /builddir/build/BUILD/kcov-36/src/parsers/elf-parser.cc
make[2]: Leaving directory '/builddir/build/BUILD/kcov-36/build-tools'
make[2]: Entering directory '/builddir/build/BUILD/kcov-36/build-tools'
[ 91%] Building CXX object CMakeFiles/line2addr.dir/line2addr.cc.o
/usr/bin/c++   -I/builddir/build/BUILD/kcov-36/tools/../src/include  -std=c++0x -g -Wall -D_GLIBCXX_USE_NANOSLEEP -DKCOV_LIBRARY_PREFIX=   -o CMakeFiles/line2addr.dir/line2addr.cc.o -c /builddir/build/BUILD/kcov-36/tools/line2addr.cc
make[2]: Leaving directory '/builddir/build/BUILD/kcov-36/build-tools'
BUILDSTDERR: make[2]: Enter+ CFLAGS='-O2 -g -pipe -Wall -Werror=format-security -Wp,-D_FORTIFY_SOURCE=2 -Wp,-D_GLIBCXX_ASSERTIONS -fexceptions -fstack-protector-strong -grecord-gcc-switches -specs=/usr/lib/rpm/redhat/redhat-hardened-cc1 -specs=/usr/lib/rpm/redhat/redhat-annobin-cc1 -fasynchronous-unwind-tables -fstack-clash-protection'
+ export CFLAGS
+ CXXFLAGS='-O2 -g -pipe -Wall -Werror=format-security -Wp,-D_FORTIFY_SOURCE=2 -Wp,-D_GLIBCXX_ASSERTIONS -fexceptions -fstack-protector-strong -grecord-gcc-switches -specs=/usr/lib/rpm/redhat/redhat-hardened-cc1 -specs=/usr/lib/rpm/redhat/redhat-annobin-cc1 -fasynchronous-unwind-tables -fstack-clash-protection'
+ export CXXFLAGS
+ FFLAGS='-O2 -g -pipe -Wall -Werror=format-security -Wp,-D_FORTIFY_SOURCE=2 -Wp,-D_GLIBCXX_ASSERTIONS -fexceptions -fstack-protector-strong -grecord-gcc-switches -specs=/usr/lib/rpm/redhat/redhat-hardened-cc1 -specs=/usr/lib/rpm/redhat/redhat-annobin-cc1 -fasynchronous-unwind-tables -fstack-clash-protection -I/usr/lib64/gfortran/modules'
+ export FFLAGS
+ FCFLAGS='-O2 -g -pipe -Wall -Werror=format-security -Wp,-D_FORTIFY_SOURCE=2 -Wp,-D_GLIBCXX_ASSERTIONS -fexceptions -fstack-protector-strong -grecord-gcc-switches -specs=/usr/lib/rpm/redhat/redhat-hardened-cc1 -specs=/usr/lib/rpm/redhat/redhat-annobin-cc1 -fasynchronous-unwind-tables -fstack-clash-protection -I/usr/lib64/gfortran/modules'
+ export FCFLAGS
+ LDFLAGS='-Wl,-z,relro -Wl,--as-needed  -Wl,-z,now -specs=/usr/lib/rpm/redhat/redhat-hardened-ld'
+ export LDFLAGS
+ /usr/bin/cmake -DCMAKE_C_FLAGS_RELEASE:STRING=-DNDEBUG -DCMAKE_CXX_FLAGS_RELEASE:STRING=-DNDEBUG -DCMAKE_Fortran_FLAGS_RELEASE:STRING=-DNDEBUG -DCMAKE_VERBOSE_MAKEFILE:BOOL=ON -DCMAKE_INSTALL_PREFIX:PATH=/usr -DINCLUDE_INSTALL_DIR:PATH=/usr/include -DLIB_INSTALL_DIR:PATH=/usr/lib64 -DSYSCONF_INSTALL_DIR:PATH=/etc -DSHARE_INSTALL_PREFIX:PATH=/usr/share -DLIB_SUFFIX=64 -DBUILD_SHARED_LIBS:BOOL=ON -S . -B build
BUILDSTDERR: CMake Warning:
BUILDSTDERR:   Manually-specified variables were not used by the project:
BUILDSTDERR:     CMAKE_Fortran_FLAGS_RELEASE
BUILDSTDERR:     INCLUDE_INSTALL_DIR
BUILDSTDERR:     LIB_INSTALL_DIR
BUILDSTDERR:     LIB_SUFFIX
BUILDSTDERR:     SHARE_INSTALL_PREFIX
BUILDSTDERR:     SYSCONF_INSTALL_DIR
+ /usr/bin/make -O -j4 V=1 VERBOSE=1 -C build
ing directory '/builddir/build/BUILD/kcov-36/build-tools'
[ 83%] Building CXX object CMakeFiles/line2addr.dir/builddir/build/BUILD/kcov-36/src/utils.cc.o
/usr/bin/c++   -I/builddir/build/BUILD/kcov-36/tools/../src/include  -std=c++0x -g -Wall -D_GLIBCXX_USE_NANOSLEEP -DKCOV_LIBRARY_PREFIX=   -o CMakeFiles/line2addr.dir/builddir/build/BUILD/kcov-36/src/utils.cc.o -c /builddir/build/BUILD/kcov-36/src/utils.cc
make[2]: Leaving directory '/builddir/build/BUILD/kcov-36/build-tools'
make[2]: Entering directory '/builddir/build/BUILD/kcov-36/build-tools'
[100%] Linking CXX executable line2addr
/usr/bin/cmake -E cmake_link_script CMakeFiles/line2addr.dir/link.txt --verbose=1
/usr/bin/c++  -std=c++0x -g -Wall -D_GLIBCXX_USE_NANOSLEEP -DKCOV_LIBRARY_PREFIX=  -rdynamic CMakeFiles/line2addr.dir/builddir/build/BUILD/kcov-36/src/capabilities.cc.o CMakeFiles/line2addr.dir/builddir/build/BUILD/kcov-36/src/configuration.cc.o CMakeFiles/line2addr.dir/builddir/build/BUILD/kcov-36/src/filter.cc.o CMakeFiles/line2addr.dir/builddir/build/BUILD/kcov-36/src/gcov.cc.o CMakeFiles/line2addr.dir/builddir/build/BUILD/kcov-36/src/parsers/dwarf.cc.o CMakeFiles/line2addr.dir/builddir/build/BUILD/kcov-36/src/parsers/elf-parser.cc.o CMakeFiles/line2addr.dir/builddir/build/BUILD/kcov-36/src/parsers/elf.cc.o CMakeFiles/line2addr.dir/builddir/build/BUILD/kcov-36/src/parsers/dummy-disassembler.cc.o CMakeFiles/line2addr.dir/builddir/build/BUILD/kcov-36/src/parser-manager.cc.o CMakeFiles/line2addr.dir/builddir/build/BUILD/kcov-36/src/utils.cc.o CMakeFiles/line2addr.dir/line2addr.cc.o  -o line2addr -ldl -ldw -lelf -lm -lstdc++ -lpthread -lz 
make[2]: Leaving directory '/builddir/build/BUILD/kcov-36/build-tools'
make[1]: Entering directory '/builddir/build/BUILD/kcov-36/build-tools'
[100%] Built target line2addr
make[1]: Leaving directory '/builddir/build/BUILD/kcov-36/build-tools'
make: Entering directory '/builddir/build/BUILD/kcov-36/build-tools'
/usr/bin/cmake -E cmake_progress_start /builddir/build/BUILD/kcov-36/build-tools/CMakeFiles 0
make: Leaving directory '/builddir/build/BUILD/kcov-36/build-tools'
-- The C compiler identification is GNU 9.1.1
-- The CXX compiler identification is GNU 9.1.1
-- Check for working C compiler: /usr/bin/cc
-- Check for working C compiler: /usr/bin/cc -- works
-- Detecting C compiler ABI info
-- Detecting C compiler ABI info - done
-- Detecting C compile features
-- Detecting C compile features - done
-- Check for working CXX compiler: /usr/bin/c++
-- Check for working CXX compiler: /usr/bin/c++ -- works
-- Detecting CXX compiler ABI info
-- Detecting CXX compiler ABI info - done
-- Detecting CXX compile features
-- Detecting CXX compile features - done
-- Looking for pthread.h
-- Looking for pthread.h - found
-- Looking for pthread_create
-- Looking for pthread_create - not found
-- Looking for pthread_create in pthreads
-- Looking for pthread_create in pthreads - not found
-- Looking for pthread_create in pthread
-- Looking for pthread_create in pthread - found
-- Found Threads: TRUE  
-- Found LIBBFD: /usr/lib64/libbfd.so  
-- Target architectures: unknown
-- Found ZLIB: /usr/lib64/libz.so (found version "1.2.11") 
-- Found CURL: /usr/lib64/libcurl.so (found version "7.65.3")  
-- Found DL: /usr/lib64/libdl.so
-- Found M: /usr/lib64/libm.so
-- Found LibElf: /usr/lib64/libelf.so  
-- Found ElfUtils: /usr/lib64/libdw.so  
-- Configuring done
-- Generating done
-- Build files have been written to: /builddir/build/BUILD/kcov-36/build
make: Entering directory '/builddir/build/BUILD/kcov-36/build'
/usr/bin/cmake -S/builddir/build/BUILD/kcov-36 -B/builddir/build/BUILD/kcov-36/build --check-build-system CMakeFiles/Makefile.cmake 0
make: Leaving directory '/builddir/build/BUILD/kcov-36/build'
make: Entering directory '/builddir/build/BUILD/kcov-36/build'
/usr/bin/cmake -E cmake_progress_start /builddir/build/BUILD/kcov-36/build/CMakeFiles /builddir/build/BUILD/kcov-36/build/CMakeFiles/progress.marks
make: Leaving directory '/builddir/build/BUILD/kcov-36/build'
/usr/bin/make -f CMakeFiles/Makefile2 all
/usr/bin/make -f src/CMakeFiles/kcov_system_lib.dir/build.make src/CMakeFiles/kcov_system_lib.dir/depend
/usr/bin/make -f src/CMakeFiles/kcov_sowrapper.dir/build.make src/CMakeFiles/kcov_sowrapper.dir/depend
/usr/bin/make -f src/CMakeFiles/bash_execve_redirector.dir/build.make src/CMakeFiles/bash_execve_redirector.dir/depend
/usr/bin/make -f src/CMakeFiles/kcov-system-daemon.dir/build.make src/CMakeFiles/kcov-system-daemon.dir/depend
make[2]: Entering directory '/builddir/build/BUILD/kcov-36/build'
cd /builddir/build/BUILD/kcov-36/build && /usr/bin/cmake -E cmake_depends "Unix Makefiles" /builddir/build/BUILD/kcov-36 /builddir/build/BUILD/kcov-36/src /builddir/build/BUILD/kcov-36/build /builddir/build/BUILD/kcov-36/build/src /builddir/build/BUILD/kcov-36/build/src/CMakeFiles/kcov_sowrapper.dir/DependInfo.cmake --color=
Dependee "/builddir/build/BUILD/kcov-36/build/src/CMakeFiles/kcov_sowrapper.dir/DependInfo.cmake" is newer than depender "/builddir/build/BUILD/kcov-36/build/src/CMakeFiles/kcov_sowrapper.dir/depend.internal".
Dependee "/builddir/build/BUILD/kcov-36/build/src/CMakeFiles/CMakeDirectoryInformation.cmake" is newer than depender "/builddir/build/BUILD/kcov-36/build/src/CMakeFiles/kcov_sowrapper.dir/depend.internal".
Scanning dependencies of target kcov_sowrapper
make[2]: Leaving directory '/builddir/build/BUILD/kcov-36/build'
/usr/bin/make -f src/CMakeFiles/kcov_sowrapper.dir/build.make src/CMakeFiles/kcov_sowrapper.dir/build
make[2]: Entering directory '/builddir/build/BUILD/kcov-36/build'
cd /builddir/build/BUILD/kcov-36/build && /usr/bin/cmake -E cmake_depends "Unix Makefiles" /builddir/build/BUILD/kcov-36 /builddir/build/BUILD/kcov-36/src /builddir/build/BUILD/kcov-36/build /builddir/build/BUILD/kcov-36/build/src /builddir/build/BUILD/kcov-36/build/src/CMakeFiles/bash_execve_redirector.dir/DependInfo.cmake --color=
Dependee "/builddir/build/BUILD/kcov-36/build/src/CMakeFiles/bash_execve_redirector.dir/DependInfo.cmake" is newer than depender "/builddir/build/BUILD/kcov-36/build/src/CMakeFiles/bash_execve_redirector.dir/depend.internal".
Dependee "/builddir/build/BUILD/kcov-36/build/src/CMakeFiles/CMakeDirectoryInformation.cmake" is newer than depender "/builddir/build/BUILD/kcov-36/build/src/CMakeFiles/bash_execve_redirector.dir/depend.internal".
Scanning dependencies of target bash_execve_redirector
make[2]: Leaving directory '/builddir/build/BUILD/kcov-36/build'
/usr/bin/make -f src/CMakeFiles/bash_execve_redirector.dir/build.make src/CMakeFiles/bash_execve_redirector.dir/build
make[2]: Entering directory '/builddir/build/BUILD/kcov-36/build'
cd /builddir/build/BUILD/kcov-36/build && /usr/bin/cmake -E cmake_depends "Unix Makefiles" /builddir/build/BUILD/kcov-36 /builddir/build/BUILD/kcov-36/src /builddir/build/BUILD/kcov-36/build /builddir/build/BUILD/kcov-36/build/src /builddir/build/BUILD/kcov-36/build/src/CMakeFiles/kcov_system_lib.dir/DependInfo.cmake --color=
Dependee "/builddir/build/BUILD/kcov-36/build/src/CMakeFiles/kcov_system_lib.dir/DependInfo.cmake" is newer than depender "/builddir/build/BUILD/kcov-36/build/src/CMakeFiles/kcov_system_lib.dir/depend.internal".
Dependee "/builddir/build/BUILD/kcov-36/build/src/CMakeFiles/CMakeDirectoryInformation.cmake" is newer than depender "/builddir/build/BUILD/kcov-36/build/src/CMakeFiles/kcov_system_lib.dir/depend.internal".
Scanning dependencies of target kcov_system_lib
make[2]: Leaving directory '/builddir/build/BUILD/kcov-36/build'
/usr/bin/make -f src/CMakeFiles/kcov_system_lib.dir/build.make src/CMakeFiles/kcov_system_lib.dir/build
make[2]: Entering directory '/builddir/build/BUILD/kcov-36/build'
[  1%] Generating version.c
cd /builddir/build/BUILD/kcov-36/build/src && /usr/bin/cmake -E echo const\ char\ *kcov_version\ =\ \"36\"\; > version.c
make[2]: Leaving directory '/builddir/build/BUILD/kcov-36/build'
make[2]: Entering directory '/builddir/build/BUILD/kcov-36/build'
cd /builddir/build/BUILD/kcov-36/build && /usr/bin/cmake -E cmake_depends "Unix Makefiles" /builddir/build/BUILD/kcov-36 /builddir/build/BUILD/kcov-36/src /builddir/build/BUILD/kcov-36/build /builddir/build/BUILD/kcov-36/build/src /builddir/build/BUILD/kcov-36/build/src/CMakeFiles/kcov-system-daemon.dir/DependInfo.cmake --color=
Dependee "/builddir/build/BUILD/kcov-36/build/src/CMakeFiles/kcov-system-daemon.dir/DependInfo.cmake" is newer than depender "/builddir/build/BUILD/kcov-36/build/src/CMakeFiles/kcov-system-daemon.dir/depend.internal".
Dependee "/builddir/build/BUILD/kcov-36/build/src/CMakeFiles/CMakeDirectoryInformation.cmake" is newer than depender "/builddir/build/BUILD/kcov-36/build/src/CMakeFiles/kcov-system-daemon.dir/depend.internal".
Scanning dependencies of target kcov-system-daemon
make[2]: Leaving directory '/builddir/build/BUILD/kcov-36/build'
/usr/bin/make -f src/CMakeFiles/kcov-system-daemon.dir/build.make src/CMakeFiles/kcov-system-daemon.dir/build
make[2]: Entering directory '/builddir/build/BUILD/kcov-36/build'
[  4%] Building C object src/CMakeFiles/kcov_sowrapper.dir/solib-parser/phdr_data.c.o
cd /builddir/build/BUILD/kcov-36/build/src && /usr/bin/cc -DPACKAGE -DPACKAGE_VERSION -Dkcov_sowrapper_EXPORTS -I/builddir/build/BUILD/kcov-36/src/include -I/builddir/build/BUILD/kcov-36/src/../external/lldb/include  -O2 -g -pipe -Wall -Werror=format-security -Wp,-D_FORTIFY_SOURCE=2 -Wp,-D_GLIBCXX_ASSERTIONS -fexceptions -fstack-protector-strong -grecord-gcc-switches -specs=/usr/lib/rpm/redhat/redhat-hardened-cc1 -specs=/usr/lib/rpm/redhat/redhat-annobin-cc1 -fasynchronous-unwind-tables -fstack-clash-protection -DNDEBUG -fPIC   -o CMakeFiles/kcov_sowrapper.dir/solib-parser/phdr_data.c.o   -c /builddir/build/BUILD/kcov-36/src/solib-parser/phdr_data.c
make[2]: Leaving directory '/builddir/build/BUILD/kcov-36/build'
make[2]: Entering directory '/builddir/build/BUILD/kcov-36/build'
[  2%] Building C object src/CMakeFiles/bash_execve_redirector.dir/engines/bash-execve-redirector.c.o
cd /builddir/build/BUILD/kcov-36/build/src && /usr/bin/cc -DPACKAGE -DPACKAGE_VERSION -Dbash_execve_redirector_EXPORTS -I/builddir/build/BUILD/kcov-36/src/include -I/builddir/build/BUILD/kcov-36/src/../external/lldb/include  -O2 -g -pipe -Wall -Werror=format-security -Wp,-D_FORTIFY_SOURCE=2 -Wp,-D_GLIBCXX_ASSERTIONS -fexceptions -fstack-protector-strong -grecord-gcc-switches -specs=/usr/lib/rpm/redhat/redhat-hardened-cc1 -specs=/usr/lib/rpm/redhat/redhat-annobin-cc1 -fasynchronous-unwind-tables -fstack-clash-protection -DNDEBUG -fPIC   -o CMakeFiles/bash_execve_redirector.dir/engines/bash-execve-redirector.c.o   -c /builddir/build/BUILD/kcov-36/src/engines/bash-execve-redirector.c
make[2]: Leaving directory '/builddir/build/BUILD/kcov-36/build'
make[2]: Entering directory '/builddir/build/BUILD/kcov-36/build'
[  9%] Linking C shared library libbash_execve_redirector.so
cd /builddir/build/BUILD/kcov-36/build/src && /usr/bin/cmake -E cmake_link_script CMakeFiles/bash_execve_redirector.dir/link.txt --verbose=1
/usr/bin/cc -fPIC -O2 -g -pipe -Wall -Werror=format-security -Wp,-D_FORTIFY_SOURCE=2 -Wp,-D_GLIBCXX_ASSERTIONS -fexceptions -fstack-protector-strong -grecord-gcc-switches -specs=/usr/lib/rpm/redhat/redhat-hardened-cc1 -specs=/usr/lib/rpm/redhat/redhat-annobin-cc1 -fasynchronous-unwind-tables -fstack-clash-protection -DNDEBUG -Wl,-z,relro -Wl,--as-needed  -Wl,-z,now -specs=/usr/lib/rpm/redhat/redhat-hardened-ld -shared -Wl,-soname,libbash_execve_redirector.so -o libbash_execve_redirector.so CMakeFiles/bash_execve_redirector.dir/engines/bash-execve-redirector.c.o -ldl 
make[2]: Leaving directory '/builddir/build/BUILD/kcov-36/build'
make[1]: Entering directory '/builddir/build/BUILD/kcov-36/build'
[  9%] Built target bash_execve_redirector
make[1]: Leaving directory '/builddir/build/BUILD/kcov-36/build'
make[2]: Entering directory '/builddir/build/BUILD/kcov-36/build'
[  8%] Building C object src/CMakeFiles/kcov_sowrapper.dir/solib-parser/lib.c.o
BUILDSTDERR: cd /builddir/build/BUILD/kcov-36/build/src && /usr/bin/cc -DPACKAGE -DPACKAGE_VERSION -Dkcov_sowrapper_EXPORTS -I/builddir/build/BUILD/kcov-36/src/include -I/builddir/build/BUILD/kcov-36/src/../external/lldb/include  -O2 -g -pipe -Wall -Werror=format-security -Wp,-D_FORTIFY_SOURCE=2 -Wp,-D_GLIB/builddir/build/BUILD/kcov-36/src/solib-parser/lib.c: In function 'force_breakpoint':
BUILDSTDERR: /builddir/build/BUILD/kcov-36/src/solib-parser/lib.c:96:3: error: #error Unsupported architecture
BUILDSTDERR:    96 | # error Unsupported architecture
BUILDSTDERR:       |   ^~~~~
BUILDSTDERR: /builddir/build/BUILD/kcov-36/src/solib-parser/lib.c:98:4: error: expected string literal before ')' token
BUILDSTDERR:    98 |    );
BUILDSTDERR:       |    ^
BUILDSTDERR: make[2]: *** [src/CMakeFiles/kcov_sowrapper.dir/build.make:79: src/CMakeFiles/kcov_sowrapper.dir/solib-parser/lib.c.o] Error 1
BUILDSTDERR: make[1]: *** [CMakeFiles/Makefile2:139: src/CMakeFiles/kcov_sowrapper.dir/all] Error 2
BUILDSTDERR: make[1]: *** Waiting for unfinished jobs....
CXX_ASSERTIONS -fexceptions -fstack-protector-strong -grecord-gcc-switches -specs=/usr/lib/rpm/redhat/redhat-hardened-cc1 -specs=/usr/lib/rpm/redhat/redhat-annobin-cc1 -fasynchronous-unwind-tables -fstack-clash-protection -DNDEBUG -fPIC   -o CMakeFiles/kcov_sowrapper.dir/solib-parser/lib.c.o   -c /builddir/build/BUILD/kcov-36/src/solib-parser/lib.c
make[2]: Leaving directory '/builddir/build/BUILD/kcov-36/build'
make[2]: Entering directory '/builddir/build/BUILD/kcov-36/build'
[ 12%] Building CXX object src/CMakeFiles/kcov-system-daemon.dir/dummy-solib-handler.cc.o
cd /builddir/build/BUILD/kcov-36/build/src && /usr/bin/c++  -DPACKAGE -DPACKAGE_VERSION -I/builddir/build/BUILD/kcov-36/src/include -I/builddir/build/BUILD/kcov-36/src/../external/lldb/include  -O2 -g -pipe -Wall -Werror=format-security -Wp,-D_FORTIFY_SOURCE=2 -Wp,-D_GLIBCXX_ASSERTIONS -fexceptions -fstack-protector-strong -grecord-gcc-switches -specs=/usr/lib/rpm/redhat/redhat-hardened-cc1 -specs=/usr/lib/rpm/redhat/redhat-annobin-cc1 -fasynchronous-unwind-tables -fstack-clash-protection -std=c++0x -g -Wall -D_GLIBCXX_USE_NANOSLEEP -DKCOV_LIBRARY_PREFIX=/tmp -DKCOV_HAS_LIBBFD=0 -DNDEBUG   -o CMakeFiles/kcov-system-daemon.dir/dummy-solib-handler.cc.o -c /builddir/build/BUILD/kcov-36/src/dummy-solib-handler.cc
make[2]: Leaving directory '/builddir/build/BUILD/kcov-36/build'
make[2]: Entering directory '/builddir/build/BUILD/kcov-36/build'
[  5%] Building CXX object src/CMakeFiles/kcov_system_lib.dir/engines/system-mode-binary-lib.cc.o
cd /builddir/build/BUILD/kcov-36/build/src && /usr/bin/c++  -DPACKAGE -DPACKAGE_VERSION -Dkcov_system_lib_EXPORTS -I/builddir/build/BUILD/kcov-36/src/include -I/builddir/build/BUILD/kcov-36/src/../external/lldb/include  -O2 -g -pipe -Wall -Werror=format-security -Wp,-D_FORTIFY_SOURCE=2 -Wp,-D_GLIBCXX_ASSERTIONS -fexceptions -fstack-protector-strong -grecord-gcc-switches -specs=/usr/lib/rpm/redhat/redhat-hardened-cc1 -specs=/usr/lib/rpm/redhat/redhat-annobin-cc1 -fasynchronous-unwind-tables -fstack-clash-protection -std=c++0x -g -Wall -D_GLIBCXX_USE_NANOSLEEP -DKCOV_LIBRARY_PREFIX=/tmp -DKCOV_HAS_LIBBFD=0 -DNDEBUG -fPIC   -o CMakeFiles/kcov_system_lib.dir/engines/system-mode-binary-lib.cc.o -c /builddir/build/BUILD/kcov-36/src/engines/system-mode-binary-lib.cc
make[2]: Leaving directory '/builddir/build/BUILD/kcov-36/build'
make[2]: Entering directory '/builddir/build/BUILD/kcov-36/build'
[ 13%] Building CXX object src/CMakeFiles/kcov_system_lib.dir/system-mode/registration.cc.o
cd /builddir/build/BUILD/kcov-36/build/src && /usr/bin/c++  -DPACKAGE -DPACKAGE_VERSION -Dkcov_system_lib_EXPORTS -I/builddir/build/BUILD/kcov-36/src/include -I/builddir/build/BUILD/kcov-36/src/../external/lldb/include  -O2 -g -pipe -Wall -Werror=format-security -Wp,-D_FORTIFY_SOURCE=2 -Wp,-D_GLIBCXX_ASSERTIONS -fexceptions -fstack-protector-strong -grecord-gcc-switches -specs=/usr/lib/rpm/redhat/redhat-hardened-cc1 -specs=/usr/lib/rpm/redhat/redhat-annobin-cc1 -fasynchronous-unwind-tables -fstack-clash-protection -std=c++0x -g -Wall -D_GLIBCXX_USE_NANOSLEEP -DKCOV_LIBRARY_PREFIX=/tmp -DKCOV_HAS_LIBBFD=0 -DNDEBUG -fPIC   -o CMakeFiles/kcov_system_lib.dir/system-mode/registration.cc.o -c /builddir/build/BUILD/kcov-36/src/system-mode/registration.cc
make[2]: Leaving directory '/builddir/build/BUILD/kcov-36/build'
make[2]: Entering directory '/builddir/build/BUILD/kcov-36/build'
[ 14%] Building CXX object src/CMakeFiles/kcov-system-daemon.dir/engine-factory.cc.o
BUILDSTDERR: cd /builddir/build/BUILD/kcov-36/build/src && /usr/bin/c++  -DPACKAGE -DPACKAGE_VERSION -I/builddir/build/BUILD/kcov-36/src/include -I/builddir/build/BUILD/kcov-36/src/../external/lldb/include  -O2 -g -pipe -Wall -Werror=format-security -Wp,-D_FORTIFY_SOURCE=2 -Wp,-D_GLIBCXX_ASSERTIONS -fexceptions -fstack-protector-strong -grecord-gcc-switches -specs=/usr/lib/rpm/redhat/redhat-hardened-cc1 -specs=/usr/lib/rpm/redhat/redhat-annobin-cc1 -fasynchronous-unwind-tables -fstack-clash-protection -std=c++0x -g -Wall -D_GLIBCXX_USE_NANOSLEEP -DKCOV_LIBRARY_PREFIX=/tmp -DKCOV_HAS_LIBBFD=0 -DNDEBUG   -o CMakeFile/builddir/build/BUILD/kcov-36/src/engines/ptrace.cc:51:3: error: #error Unsupported architecture
BUILDSTDERR:    51 | # error Unsupported architecture
BUILDSTDERR:       |   ^~~~~
BUILDSTDERR: make[2]: *** [src/CMakeFiles/kcov-system-daemon.dir/build.make:122: src/CMakeFiles/kcov-system-daemon.dir/engines/ptrace.cc.o] Error 1
BUILDSTDERR: make[2]: *** Waiting for unfinished jobs....
s/kcov-system-daemon.dir/engine-factory.cc.o -c /builddir/build/BUILD/kcov-36/src/engine-factory.cc
make[2]: Leaving directory '/builddir/build/BUILD/kcov-36/build'
make[2]: Entering directory '/builddir/build/BUILD/kcov-36/build'
[ 16%] Building CXX object src/CMakeFiles/kcov-system-daemon.dir/engines/system-mode-file-format.cc.o
cd /builddir/build/BUILD/kcov-36/build/src && /usr/bin/c++  -DPACKAGE -DPACKAGE_VERSION -I/builddir/build/BUILD/kcov-36/src/include -I/builddir/build/BUILD/kcov-36/src/../external/lldb/include  -O2 -g -pipe -Wall -Werror=format-security -Wp,-D_FORTIFY_SOURCE=2 -Wp,-D_GLIBCXX_ASSERTIONS -fexceptions -fstack-protector-strong -grecord-gcc-switches -specs=/usr/lib/rpm/redhat/redhat-hardened-cc1 -specs=/usr/lib/rpm/redhat/redhat-annobin-cc1 -fasynchronous-unwind-tables -fstack-clash-protection -std=c++0x -g -Wall -D_GLIBCXX_USE_NANOSLEEP -DKCOV_LIBRARY_PREFIX=/tmp -DKCOV_HAS_LIBBFD=0 -DNDEBUG   -o CMakeFiles/kcov-system-daemon.dir/engines/system-mode-file-format.cc.o -c /builddir/build/BUILD/kcov-36/src/engines/system-mode-file-format.cc
make[2]: Leaving directory '/builddir/build/BUILD/kcov-36/build'
make[2]: Entering directory '/builddir/build/BUILD/kcov-36/build'
[ 17%] Building CXX object src/CMakeFiles/kcov-system-daemon.dir/engines/ptrace.cc.o
cd /builddir/build/BUILD/kcov-36/build/src && /usr/bin/c++  -DPACKAGE -DPACKAGE_VERSION -I/builddir/build/BUILD/kcov-36/src/include -I/builddir/build/BUILD/kcov-36/src/../external/lldb/include  -O2 -g -pipe -Wall -Werror=format-security -Wp,-D_FORTIFY_SOURCE=2 -Wp,-D_GLIBCXX_ASSERTIONS -fexceptions -fstack-protector-strong -grecord-gcc-switches -specs=/usr/lib/rpm/redhat/redhat-hardened-cc1 -specs=/usr/lib/rpm/redhat/redhat-annobin-cc1 -fasynchronous-unwind-tables -fstack-clash-protection -std=c++0x -g -Wall -D_GLIBCXX_USE_NANOSLEEP -DKCOV_LIBRARY_PREFIX=/tmp -DKCOV_HAS_LIBBFD=0 -DNDEBUG   -o CMakeFiles/kcov-system-daemon.dir/engines/ptrace.cc.o -c /builddir/build/BUILD/kcov-36/src/engines/ptrace.cc
make[2]: Leaving directory '/builddir/build/BUILD/kcov-36/build'
make[2]: Entering directory '/builddir/build/BUILD/kcov-36/build'
[ 10%] Building CXX object src/CMakeFiles/kcov_system_lib.dir/utils.cc.o
cd /builddir/build/BUILD/kcov-36/build/src && /usr/bin/c++  -DPACKAGE -DPACKAGE_VERSION -Dkcov_system_lib_EXPORTS -I/builddir/build/BUILD/kcov-36/src/include -I/builddir/build/BUILD/kcov-36/src/../external/lldb/include  -O2 -g -pipe -Wall -Werror=format-security -Wp,-D_FORTIFY_SOURCE=2 -Wp,-D_GLIBCXX_ASSERTIONS -fexceptions -fstack-protector-strong -grecord-gcc-switches -specs=/usr/lib/rpm/redhat/redhat-hardened-cc1 -specs=/usr/lib/rpm/redhat/redhat-annobin-cc1 -fasynchronous-unwind-tables -fstack-clash-protection -std=c++0x -g -Wall -D_GLIBCXX_USE_NANOSLEEP -DKCOV_LIBRARY_PREFIX=/tmp -DKCOV_HAS_LIBBFD=0 -DNDEBUG -fPIC   -o CMakeFiles/kcov_system_lib.dir/utils.cc.o -c /builddir/build/BUILD/kcov-36/src/utils.cc
make[2]: Leaving directory '/builddir/build/BUILD/kcov-36/build'
make[2]: Entering directory '/builddir/build/BUILD/kcov-36/build'
[ 20%] Linking CXX shared library libkcov_system_lib.so
cd /builddir/build/BUILD/kcov-36/build/src && /usr/bin/cmake -E cmake_link_script CMakeFiles/kcov_system_lib.dir/link.txt --verbose=1
/usr/bin/c++ -fPIC -O2 -g -pipe -Wall -Werror=format-security -Wp,-D_FORTIFY_SOURCE=2 -Wp,-D_GLIBCXX_ASSERTIONS -fexceptions -fstack-protector-strong -grecord-gcc-switches -specs=/usr/lib/rpm/redhat/redhat-hardened-cc1 -specs=/usr/lib/rpm/redhat/redhat-annobin-cc1 -fasynchronous-unwind-tables -fstack-clash-protection -std=c++0x -g -Wall -D_GLIBCXX_USE_NANOSLEEP -DKCOV_LIBRARY_PREFIX=/tmp -DKCOV_HAS_LIBBFD=0 -DNDEBUG -Wl,-z,relro -Wl,--as-needed  -Wl,-z,now -specs=/usr/lib/rpm/redhat/redhat-hardened-ld -shared -Wl,-soname,libkcov_system_lib.so -o libkcov_system_lib.so CMakeFiles/kcov_system_lib.dir/engines/system-mode-binary-lib.cc.o CMakeFiles/kcov_system_lib.dir/utils.cc.o CMakeFiles/kcov_system_lib.dir/system-mode/registration.cc.o -ldl 
make[2]: Leaving directory '/builddir/build/BUILD/kcov-36/build'
BUILDSTDERR: make[1]: Entering directory '/build/builddir/build/BUILD/kcov-36/src/engines/ptrace_linux.cc:51:3: error: #error Unsupported architecture
BUILDSTDERR:    51 | # error Unsupported architecture
BUILDSTDERR:       |   ^~~~~
BUILDSTDERR: /builddir/build/BUILD/kcov-36/src/engines/ptrace_linux.cc:71:3: error: #error Unsupported architecture
BUILDSTDERR:    71 | # error Unsupported architecture
BUILDSTDERR:       |   ^~~~~
BUILDSTDERR: make[2]: *** [src/CMakeFiles/kcov-system-daemon.dir/build.make:135: src/CMakeFiles/kcov-system-daemon.dir/engines/ptrace_linux.cc.o] Error 1
BUILDSTDERR: make[1]: *** [CMakeFiles/Makefile2:213: src/CMakeFiles/kcov-system-daemon.dir/all] Error 2
BUILDSTDERR: make: *** [Makefile:155: all] Error 2
error: dir/build/BUILD/kcov-36/build'
[ 20%] Built target kcov_system_lib
make[1]: Leaving directory '/builddir/build/BUILD/kcov-36/build'
make[2]: Entering directory '/builddir/build/BUILD/kcov-36/build'
[ 18%] Building CXX object src/CMakeFiles/kcov-system-daemon.dir/engines/ptrace_linux.cc.o
cd /builddir/build/BUILD/kcov-36/build/src && /usr/bin/c++  -DPACKAGE -DPACKAGE_VERSION -I/builddir/build/BUILD/kcov-36/src/include -I/builddir/build/BUILD/kcov-36/src/../external/lldb/include  -O2 -g -pipe -Wall -Werror=format-security -Wp,-D_FORTIFY_SOURCE=2 -Wp,-D_GLIBCXX_ASSERTIONS -fexceptions -fstack-protector-strong -grecord-gcc-switches -specs=/usr/lib/rpm/redhat/redhat-hardened-cc1 -specs=/usr/lib/rpm/redhat/redhat-annobin-cc1 -fasynchronous-unwind-tables -fstack-clash-protection -std=c++0x -g -Wall -D_GLIBCXX_USE_NANOSLEEP -DKCOV_LIBRARY_PREFIX=/tmp -DKCOV_HAS_LIBBFD=0 -DNDEBUG   -o CMakeFiles/kcov-system-daemon.dir/engines/ptrace_linux.cc.o -c /builddir/build/BUILD/kcov-36/src/engines/ptrace_linux.cc
make[2]: Leaving directory '/builddir/build/BUILD/kcov-36/build'
make[2]: Entering directory '/builddir/build/BUILD/kcov-36/build'
[  6%] Building CXX object src/CMakeFiles/kcov-system-daemon.dir/configuration.cc.o
cd /builddir/build/BUILD/kcov-36/build/src && /usr/bin/c++  -DPACKAGE -DPACKAGE_VERSION -I/builddir/build/BUILD/kcov-36/src/include -I/builddir/build/BUILD/kcov-36/src/../external/lldb/include  -O2 -g -pipe -Wall -Werror=format-security -Wp,-D_FORTIFY_SOURCE=2 -Wp,-D_GLIBCXX_ASSERTIONS -fexceptions -fstack-protector-strong -grecord-gcc-switches -specs=/usr/lib/rpm/redhat/redhat-hardened-cc1 -specs=/usr/lib/rpm/redhat/redhat-annobin-cc1 -fasynchronous-unwind-tables -fstack-clash-protection -std=c++0x -g -Wall -D_GLIBCXX_USE_NANOSLEEP -DKCOV_LIBRARY_PREFIX=/tmp -DKCOV_HAS_LIBBFD=0 -DNDEBUG   -o CMakeFiles/kcov-system-daemon.dir/configuration.cc.o -c /builddir/build/BUILD/kcov-36/src/configuration.cc
make[2]: Leaving directory '/builddir/build/BUILD/kcov-36/build'
RPM build errors:
BUILDSTDERR: Bad exit status from /var/tmp/rpm-tmp.xDkzxm (%build)
BUILDSTDERR:     Bad exit status from /var/tmp/rpm-tmp.xDkzxm (%build)
Child return code was: 1
EXCEPTION: [Error()]
Traceback (most recent call last):
  File "/usr/lib/python3.7/site-packages/mockbuild/trace_decorator.py", line 96, in trace
    result = func(*args, **kw)
  File "/usr/lib/python3.7/site-packages/mockbuild/util.py", line 700, in do
    raise exception.Error("Command failed: \n # %s\n%s" % (command, output), child.returncode)
mockbuild.exception.Error: Command failed: 
 # bash --login -c /usr/bin/rpmbuild -bb --target riscv64 --nodeps /builddir/build/SPECS/kcov.spec