Mock Version: 3.5
Mock Version: 3.5
Mock Version: 3.5
ENTER ['do_with_status'](['bash', '--login', '-c', '/usr/bin/rpmbuild -bs --noclean --target riscv64 --nodeps /builddir/build/SPECS/dapl.spec'], chrootPath='/var/lib/mock/f40-build-762311-121848/root'env={'TERM': 'vt100', 'SHELL': '/bin/bash', 'HOME': '/builddir', 'HOSTNAME': 'mock', 'PATH': '/usr/bin:/bin:/usr/sbin:/sbin', 'PROMPT_COMMAND': 'printf "\\033]0;<mock-chroot>\\007"', 'PS1': '<mock-chroot> \\s-\\v\\$ ', 'LANG': 'C.UTF-8'}shell=Falselogger=<mockbuild.trace_decorator.getLog object at 0x3f8564ac90>timeout=1209600uid=991gid=135user='mockbuild'nspawn_args=[]unshare_net=TrueprintOutput=False)
Executing command: ['bash', '--login', '-c', '/usr/bin/rpmbuild -bs --noclean --target riscv64 --nodeps /builddir/build/SPECS/dapl.spec'] with env {'TERM': 'vt100', 'SHELL': '/bin/bash', 'HOME': '/builddir', 'HOSTNAME': 'mock', 'PATH': '/usr/bin:/bin:/usr/sbin:/sbin', 'PROMPT_COMMAND': 'printf "\\033]0;<mock-chroot>\\007"', 'PS1': '<mock-chroot> \\s-\\v\\$ ', 'LANG': 'C.UTF-8'} and shell False
Building target platforms: riscv64
Building for target riscv64
setting SOURCE_DATE_EPOCH=1689724800
Wrote: /builddir/build/SRPMS/dapl-2.1.9-19.fc40.src.rpm
Child return code was: 0
ENTER ['do_with_status'](['bash', '--login', '-c', '/usr/bin/rpmbuild -bb --noclean --target riscv64 --nodeps /builddir/build/SPECS/dapl.spec'], chrootPath='/var/lib/mock/f40-build-762311-121848/root'env={'TERM': 'vt100', 'SHELL': '/bin/bash', 'HOME': '/builddir', 'HOSTNAME': 'mock', 'PATH': '/usr/bin:/bin:/usr/sbin:/sbin', 'PROMPT_COMMAND': 'printf "\\033]0;<mock-chroot>\\007"', 'PS1': '<mock-chroot> \\s-\\v\\$ ', 'LANG': 'C.UTF-8'}shell=Falselogger=<mockbuild.trace_decorator.getLog object at 0x3f8564ac90>timeout=1209600uid=991gid=135user='mockbuild'nspawn_args=[]unshare_net=TrueprintOutput=False)
Executing command: ['bash', '--login', '-c', '/usr/bin/rpmbuild -bb --noclean --target riscv64 --nodeps /builddir/build/SPECS/dapl.spec'] with env {'TERM': 'vt100', 'SHELL': '/bin/bash', 'HOME': '/builddir', 'HOSTNAME': 'mock', 'PATH': '/usr/bin:/bin:/usr/sbin:/sbin', 'PROMPT_COMMAND': 'printf "\\033]0;<mock-chroot>\\007"', 'PS1': '<mock-chroot> \\s-\\v\\$ ', 'LANG': 'C.UTF-8'} and shell False
Building target platforms: riscv64
Building for target riscv64
setting SOURCE_DATE_EPOCH=1689724800
Executing(%prep): /bin/sh -e /var/tmp/rpm-tmp.PWTpD7
+ umask 022
+ cd /builddir/build/BUILD
+ cd /builddir/build/BUILD
+ rm -rf dapl-2.1.9
+ /usr/lib/rpm/rpmuncompress -x /builddir/build/SOURCES/dapl-2.1.9.tar.gz
+ STATUS=0
+ '[' 0 -ne 0 ']'
+ cd dapl-2.1.9
+ rm -rf /builddir/build/BUILD/dapl-2.1.9-SPECPARTS
+ /usr/bin/mkdir -p /builddir/build/BUILD/dapl-2.1.9-SPECPARTS
+ /usr/bin/chmod -Rf a+rX,u+w,g-w,o-w .
+ /usr/lib/rpm/rpmuncompress /builddir/build/SOURCES/dapl-c99.patch
+ /usr/bin/patch -p1 -s --fuzz=0 --no-backup-if-mismatch -f
+ find . -type f -iname '*.[ch]' -exec chmod a-x '{}' ';'
+ RPM_EC=0
++ jobs -p
+ exit 0
Executing(%build): /bin/sh -e /var/tmp/rpm-tmp.NH0Prs
+ umask 022
+ cd /builddir/build/BUILD
+ CFLAGS='-O2  -fexceptions -g -grecord-gcc-switches -pipe -Wall -Werror=format-security -Werror=implicit-function-declaration -Werror=implicit-int -Wp,-U_FORTIFY_SOURCE,-D_FORTIFY_SOURCE=3 -Wp,-D_GLIBCXX_ASSERTIONS -specs=/usr/lib/rpm/redhat/redhat-hardened-cc1 -fstack-protector-strong -specs=/usr/lib/rpm/redhat/redhat-annobin-cc1  -fasynchronous-unwind-tables -fno-omit-frame-pointer '
+ export CFLAGS
+ CXXFLAGS='-O2  -fexceptions -g -grecord-gcc-switches -pipe -Wall -Werror=format-security -Wp,-U_FORTIFY_SOURCE,-D_FORTIFY_SOURCE=3 -Wp,-D_GLIBCXX_ASSERTIONS -specs=/usr/lib/rpm/redhat/redhat-hardened-cc1 -fstack-protector-strong -specs=/usr/lib/rpm/redhat/redhat-annobin-cc1  -fasynchronous-unwind-tables -fno-omit-frame-pointer '
+ export CXXFLAGS
+ FFLAGS='-O2  -fexceptions -g -grecord-gcc-switches -pipe -Wall -Wp,-U_FORTIFY_SOURCE,-D_FORTIFY_SOURCE=3 -Wp,-D_GLIBCXX_ASSERTIONS -specs=/usr/lib/rpm/redhat/redhat-hardened-cc1 -fstack-protector-strong -specs=/usr/lib/rpm/redhat/redhat-annobin-cc1  -fasynchronous-unwind-tables -fno-omit-frame-pointer -I/usr/lib64/gfortran/modules '
+ export FFLAGS
+ FCFLAGS='-O2  -fexceptions -g -grecord-gcc-switches -pipe -Wall -Wp,-U_FORTIFY_SOURCE,-D_FORTIFY_SOURCE=3 -Wp,-D_GLIBCXX_ASSERTIONS -specs=/usr/lib/rpm/redhat/redhat-hardened-cc1 -fstack-protector-strong -specs=/usr/lib/rpm/redhat/redhat-annobin-cc1  -fasynchronous-unwind-tables -fno-omit-frame-pointer -I/usr/lib64/gfortran/modules '
+ export FCFLAGS
+ VALAFLAGS=-g
+ export VALAFLAGS
+ RUSTFLAGS='-Copt-level=3 -Cdebuginfo=2 -Ccodegen-units=1 -Cstrip=none -Cforce-frame-pointers=yes -Clink-arg=-Wl,-z,relro -Clink-arg=-Wl,-z,now -Clink-arg=-specs=/usr/lib/rpm/redhat/redhat-package-notes --cap-lints=warn'
+ export RUSTFLAGS
+ LDFLAGS='-Wl,-z,relro -Wl,--as-needed  -Wl,-z,now -specs=/usr/lib/rpm/redhat/redhat-hardened-ld -specs=/usr/lib/rpm/redhat/redhat-annobin-cc1  -Wl,--build-id=sha1 -specs=/usr/lib/rpm/redhat/redhat-package-notes '
+ export LDFLAGS
+ LT_SYS_LIBRARY_PATH=/usr/lib64:
+ export LT_SYS_LIBRARY_PATH
+ CC=gcc
+ export CC
+ CXX=g++
+ export CXX
+ cd dapl-2.1.9
+ CFLAGS='-O2  -fexceptions -g -grecord-gcc-switches -pipe -Wall -Werror=format-security -Werror=implicit-function-declaration -Werror=implicit-int -Wp,-U_FORTIFY_SOURCE,-D_FORTIFY_SOURCE=3 -Wp,-D_GLIBCXX_ASSERTIONS -specs=/usr/lib/rpm/redhat/redhat-hardened-cc1 -fstack-protector-strong -specs=/usr/lib/rpm/redhat/redhat-annobin-cc1  -fasynchronous-unwind-tables -fno-omit-frame-pointer '
+ export CFLAGS
+ CXXFLAGS='-O2  -fexceptions -g -grecord-gcc-switches -pipe -Wall -Werror=format-security -Wp,-U_FORTIFY_SOURCE,-D_FORTIFY_SOURCE=3 -Wp,-D_GLIBCXX_ASSERTIONS -specs=/usr/lib/rpm/redhat/redhat-hardened-cc1 -fstack-protector-strong -specs=/usr/lib/rpm/redhat/redhat-annobin-cc1  -fasynchronous-unwind-tables -fno-omit-frame-pointer '
+ export CXXFLAGS
+ FFLAGS='-O2  -fexceptions -g -grecord-gcc-switches -pipe -Wall -Wp,-U_FORTIFY_SOURCE,-D_FORTIFY_SOURCE=3 -Wp,-D_GLIBCXX_ASSERTIONS -specs=/usr/lib/rpm/redhat/redhat-hardened-cc1 -fstack-protector-strong -specs=/usr/lib/rpm/redhat/redhat-annobin-cc1  -fasynchronous-unwind-tables -fno-omit-frame-pointer -I/usr/lib64/gfortran/modules '
+ export FFLAGS
+ FCFLAGS='-O2  -fexceptions -g -grecord-gcc-switches -pipe -Wall -Wp,-U_FORTIFY_SOURCE,-D_FORTIFY_SOURCE=3 -Wp,-D_GLIBCXX_ASSERTIONS -specs=/usr/lib/rpm/redhat/redhat-hardened-cc1 -fstack-protector-strong -specs=/usr/lib/rpm/redhat/redhat-annobin-cc1  -fasynchronous-unwind-tables -fno-omit-frame-pointer -I/usr/lib64/gfortran/modules '
+ export FCFLAGS
+ VALAFLAGS=-g
+ export VALAFLAGS
+ RUSTFLAGS='-Copt-level=3 -Cdebuginfo=2 -Ccodegen-units=1 -Cstrip=none -Cforce-frame-pointers=yes -Clink-arg=-Wl,-z,relro -Clink-arg=-Wl,-z,now -Clink-arg=-specs=/usr/lib/rpm/redhat/redhat-package-notes --cap-lints=warn'
+ export RUSTFLAGS
+ LDFLAGS='-Wl,-z,relro -Wl,--as-needed  -Wl,-z,now -specs=/usr/lib/rpm/redhat/redhat-hardened-ld -specs=/usr/lib/rpm/redhat/redhat-annobin-cc1  -Wl,--build-id=sha1 -specs=/usr/lib/rpm/redhat/redhat-package-notes '
+ export LDFLAGS
+ LT_SYS_LIBRARY_PATH=/usr/lib64:
+ export LT_SYS_LIBRARY_PATH
+ CC=gcc
+ export CC
+ CXX=g++
+ export CXX
+ '[' x '!=' x ']'
+ '[' 1 = 1 ']'
+++ dirname ./configure
++ find . -name config.guess -o -name config.sub
+ for i in $(find $(dirname ./configure) -name config.guess -o -name config.sub)
++ basename ./config/config.sub
+ '[' -f /usr/lib/rpm/redhat/config.sub ']'
+ /usr/bin/rm -f ./config/config.sub
++ basename ./config/config.sub
+ /usr/bin/cp -fv /usr/lib/rpm/redhat/config.sub ./config/config.sub
'/usr/lib/rpm/redhat/config.sub' -> './config/config.sub'
+ for i in $(find $(dirname ./configure) -name config.guess -o -name config.sub)
++ basename ./config/config.guess
+ '[' -f /usr/lib/rpm/redhat/config.guess ']'
+ /usr/bin/rm -f ./config/config.guess
++ basename ./config/config.guess
+ /usr/bin/cp -fv /usr/lib/rpm/redhat/config.guess ./config/config.guess
'/usr/lib/rpm/redhat/config.guess' -> './config/config.guess'
+ '[' 1 = 1 ']'
+ '[' x '!=' 'x-Wl,-z,now -specs=/usr/lib/rpm/redhat/redhat-hardened-ld' ']'
++ find . -name ltmain.sh
+ for i in $(find . -name ltmain.sh)
+ /usr/bin/sed -i.backup -e 's~compiler_flags=$~compiler_flags="-Wl,-z,now -specs=/usr/lib/rpm/redhat/redhat-hardened-ld"~' ./config/ltmain.sh
++ grep -q runstatedir=DIR ./configure
+ ./configure --build=riscv64-redhat-linux-gnu --host=riscv64-redhat-linux-gnu --program-prefix= --disable-dependency-tracking --prefix=/usr --exec-prefix=/usr --bindir=/usr/bin --sbindir=/usr/sbin --sysconfdir=/etc --datadir=/usr/share --includedir=/usr/include --libdir=/usr/lib64 --libexecdir=/usr/libexec --localstatedir=/var --sharedstatedir=/var/lib --mandir=/usr/share/man --infodir=/usr/share/info --sysconfdir=/etc/rdma
checking for a BSD-compatible install... /usr/bin/install -c
checking whether build environment is sane... yes
checking for a thread-safe mkdir -p... /usr/bin/mkdir -p
checking for gawk... gawk
checking whether make sets $(MAKE)... yes
checking whether make supports nested variables... yes
checking whether make supports nested variables... (cached) yes
checking build system type... riscv64-redhat-linux-gnu
checking host system type... riscv64-redhat-linux-gnu
checking how to print strings... printf
checking for style of include used by make... GNU
checking for riscv64-redhat-linux-gnu-gcc... gcc
checking whether the C compiler works... yes
checking for C compiler default output file name... a.out
checking for suffix of executables... 
checking whether we are cross compiling... no
checking for suffix of object files... o
checking whether we are using the GNU C compiler... yes
checking whether gcc accepts -g... yes
checking for gcc option to accept ISO C89... none needed
checking whether gcc understands -c and -o together... yes
checking dependency style of gcc... none
checking for a sed that does not truncate output... /usr/bin/sed
checking for grep that handles long lines and -e... /usr/bin/grep
checking for egrep... /usr/bin/grep -E
checking for fgrep... /usr/bin/grep -F
checking for ld used by gcc... /usr/bin/ld
checking if the linker (/usr/bin/ld) is GNU ld... yes
checking for BSD- or MS-compatible name lister (nm)... /usr/bin/nm -B
checking the name lister (/usr/bin/nm -B) interface... BSD nm
checking whether ln -s works... yes
checking the maximum length of command line arguments... 1572864
checking whether the shell understands some XSI constructs... yes
checking whether the shell understands "+="... yes
checking how to convert riscv64-redhat-linux-gnu file names to riscv64-redhat-linux-gnu format... func_convert_file_noop
checking how to convert riscv64-redhat-linux-gnu file names to toolchain format... func_convert_file_noop
checking for /usr/bin/ld option to reload object files... -r
checking for riscv64-redhat-linux-gnu-objdump... no
checking for objdump... objdump
checking how to recognize dependent libraries... pass_all
checking for riscv64-redhat-linux-gnu-dlltool... no
checking for dlltool... no
checking how to associate runtime and link libraries... printf %s\n
checking for riscv64-redhat-linux-gnu-ar... no
checking for ar... ar
checking for archiver @FILE support... @
checking for riscv64-redhat-linux-gnu-strip... no
checking for strip... strip
checking for riscv64-redhat-linux-gnu-ranlib... no
checking for ranlib... ranlib
checking command to parse /usr/bin/nm -B output from gcc object... ok
checking for sysroot... no
checking for riscv64-redhat-linux-gnu-mt... no
checking for mt... no
checking if : is a manifest tool... no
checking how to run the C preprocessor... gcc -E
checking for ANSI C header files... yes
checking for sys/types.h... yes
checking for sys/stat.h... yes
checking for stdlib.h... yes
checking for string.h... yes
checking for memory.h... yes
checking for strings.h... yes
checking for inttypes.h... yes
checking for stdint.h... yes
checking for unistd.h... yes
checking for dlfcn.h... yes
checking for objdir... .libs
checking if gcc supports -fno-rtti -fno-exceptions... no
checking for gcc option to produce PIC... -fPIC -DPIC
checking if gcc PIC flag -fPIC -DPIC works... yes
checking if gcc static flag -static works... no
checking if gcc supports -c -o file.o... yes
checking if gcc supports -c -o file.o... (cached) yes
checking whether the gcc linker (/usr/bin/ld) supports shared libraries... yes
checking whether -lc should be explicitly linked in... no
checking dynamic linker characteristics... GNU/Linux ld.so
checking how to hardcode library paths into programs... immediate
checking whether stripping libraries is possible... yes
checking if libtool supports shared libraries... yes
checking whether to build shared libraries... yes
checking whether to build static libraries... yes
checking for riscv64-redhat-linux-gnu-gcc... (cached) gcc
checking whether we are using the GNU C compiler... (cached) yes
checking whether gcc accepts -g... (cached) yes
checking for gcc option to accept ISO C89... (cached) none needed
checking whether gcc understands -c and -o together... (cached) yes
checking dependency style of gcc... (cached) none
checking infiniband/verbs.h usability... yes
checking infiniband/verbs.h presence... yes
checking for infiniband/verbs.h... yes
checking arpa/inet.h usability... yes
checking arpa/inet.h presence... yes
checking for arpa/inet.h... yes
checking fcntl.h usability... yes
checking fcntl.h presence... yes
checking for fcntl.h... yes
checking for inttypes.h... (cached) yes
checking malloc.h usability... yes
checking malloc.h presence... yes
checking for malloc.h... yes
checking netdb.h usability... yes
checking netdb.h presence... yes
checking for netdb.h... yes
checking netinet/in.h usability... yes
checking netinet/in.h presence... yes
checking for netinet/in.h... yes
checking stddef.h usability... yes
checking stddef.h presence... yes
checking for stddef.h... yes
checking for stdint.h... (cached) yes
checking for stdlib.h... (cached) yes
checking for string.h... (cached) yes
checking sys/ioctl.h usability... yes
checking sys/ioctl.h presence... yes
checking for sys/ioctl.h... yes
checking sys/socket.h usability... yes
checking sys/socket.h presence... yes
checking for sys/socket.h... yes
checking sys/time.h usability... yes
checking sys/time.h presence... yes
checking for sys/time.h... yes
checking sys/timeb.h usability... yes
checking sys/timeb.h presence... yes
checking for sys/timeb.h... yes
checking syslog.h usability... yes
checking syslog.h presence... yes
checking for syslog.h... yes
checking for unistd.h... (cached) yes
checking for struct ibv_port_attr.link_layer... yes
checking for gethostname... yes
checking for gettimeofday... yes
checking for inet_ntoa... yes
checking for memset... yes
checking for select... yes
checking for socket... yes
checking for strcasecmp... yes
checking for strdup... yes
checking for strerror... yes
checking for strtol... yes
checking for sysinfo... yes
checking whether ld accepts --version-script... yes
checking scif.h usability... no
checking scif.h presence... no
checking for scif.h... no
checking Check for SUSE_11 system... no
checking that generated files are newer than configure... done
configure: creating ./config.status
config.status: creating Makefile
config.status: creating test/dtest/Makefile
config.status: creating test/dapltest/Makefile
config.status: creating dapl.spec
config.status: creating mpxyd.init
config.status: creating config.h
config.status: executing depfiles commands
config.status: executing libtool commands
+ sed -i 's|^hardcode_libdir_flag_spec=.*|hardcode_libdir_flag_spec=""|g' libtool
+ sed -i 's|^runpath_var=LD_RUN_PATH|runpath_var=DIE_RPATH_DIE|g' libtool
+ make -j4 V=1
make  all-recursive
make[1]: Entering directory '/builddir/build/BUILD/dapl-2.1.9'
Making all in .
make[2]: Entering directory '/builddir/build/BUILD/dapl-2.1.9'
/bin/sh ./libtool  --tag=CC   --mode=compile gcc -DHAVE_CONFIG_H -I.    -g -Wall -D_GNU_SOURCE -DDAT_CONF="\"/etc/rdma/dat.conf\"" -DMPXYD_CONF="\"/etc/rdma/mpxyd.conf\"" -DPACKAGE_DATE=$(date +'%Y%m%d') -D_GNU_SOURCE -DOS_RELEASE=393216  -DDAT_EXTENSIONS   -DDEFINE_ATTR_LINK_LAYER -DOPENIB -DCQ_WAIT_OBJECT -I./dat/include/ -I./dapl/include/ -I./dapl/common -I./dapl/udapl/linux -I./dapl/openib_common -I./dapl/openib_cma -I./dapl/openib_cma/linux -O2  -fexceptions -g -grecord-gcc-switches -pipe -Wall -Werror=format-security -Werror=implicit-function-declaration -Werror=implicit-int -Wp,-U_FORTIFY_SOURCE,-D_FORTIFY_SOURCE=3 -Wp,-D_GLIBCXX_ASSERTIONS -specs=/usr/lib/rpm/redhat/redhat-hardened-cc1 -fstack-protector-strong -specs=/usr/lib/rpm/redhat/redhat-annobin-cc1  -fasynchronous-unwind-tables -fno-omit-frame-pointer  -c -o dapl_udapl_libdaplofa_la-dapl_init.lo `test -f 'dapl/udapl/dapl_init.c' || echo './'`dapl/udapl/dapl_init.c
/bin/sh ./libtool  --tag=CC   --mode=compile gcc -DHAVE_CONFIG_H -I.    -g -Wall -D_GNU_SOURCE -DDAT_CONF="\"/etc/rdma/dat.conf\"" -DMPXYD_CONF="\"/etc/rdma/mpxyd.conf\"" -DPACKAGE_DATE=$(date +'%Y%m%d') -D_GNU_SOURCE -DOS_RELEASE=393216  -DDAT_EXTENSIONS   -DDEFINE_ATTR_LINK_LAYER -DOPENIB -DCQ_WAIT_OBJECT -I./dat/include/ -I./dapl/include/ -I./dapl/common -I./dapl/udapl/linux -I./dapl/openib_common -I./dapl/openib_cma -I./dapl/openib_cma/linux -O2  -fexceptions -g -grecord-gcc-switches -pipe -Wall -Werror=format-security -Werror=implicit-function-declaration -Werror=implicit-int -Wp,-U_FORTIFY_SOURCE,-D_FORTIFY_SOURCE=3 -Wp,-D_GLIBCXX_ASSERTIONS -specs=/usr/lib/rpm/redhat/redhat-hardened-cc1 -fstack-protector-strong -specs=/usr/lib/rpm/redhat/redhat-annobin-cc1  -fasynchronous-unwind-tables -fno-omit-frame-pointer  -c -o dapl_udapl_libdaplofa_la-dapl_evd_create.lo `test -f 'dapl/udapl/dapl_evd_create.c' || echo './'`dapl/udapl/dapl_evd_create.c
/bin/sh ./libtool  --tag=CC   --mode=compile gcc -DHAVE_CONFIG_H -I.    -g -Wall -D_GNU_SOURCE -DDAT_CONF="\"/etc/rdma/dat.conf\"" -DMPXYD_CONF="\"/etc/rdma/mpxyd.conf\"" -DPACKAGE_DATE=$(date +'%Y%m%d') -D_GNU_SOURCE -DOS_RELEASE=393216  -DDAT_EXTENSIONS   -DDEFINE_ATTR_LINK_LAYER -DOPENIB -DCQ_WAIT_OBJECT -I./dat/include/ -I./dapl/include/ -I./dapl/common -I./dapl/udapl/linux -I./dapl/openib_common -I./dapl/openib_cma -I./dapl/openib_cma/linux -O2  -fexceptions -g -grecord-gcc-switches -pipe -Wall -Werror=format-security -Werror=implicit-function-declaration -Werror=implicit-int -Wp,-U_FORTIFY_SOURCE,-D_FORTIFY_SOURCE=3 -Wp,-D_GLIBCXX_ASSERTIONS -specs=/usr/lib/rpm/redhat/redhat-hardened-cc1 -fstack-protector-strong -specs=/usr/lib/rpm/redhat/redhat-annobin-cc1  -fasynchronous-unwind-tables -fno-omit-frame-pointer  -c -o dapl_udapl_libdaplofa_la-dapl_evd_query.lo `test -f 'dapl/udapl/dapl_evd_query.c' || echo './'`dapl/udapl/dapl_evd_query.c
/bin/sh ./libtool  --tag=CC   --mode=compile gcc -DHAVE_CONFIG_H -I.    -g -Wall -D_GNU_SOURCE -DDAT_CONF="\"/etc/rdma/dat.conf\"" -DMPXYD_CONF="\"/etc/rdma/mpxyd.conf\"" -DPACKAGE_DATE=$(date +'%Y%m%d') -D_GNU_SOURCE -DOS_RELEASE=393216  -DDAT_EXTENSIONS   -DDEFINE_ATTR_LINK_LAYER -DOPENIB -DCQ_WAIT_OBJECT -I./dat/include/ -I./dapl/include/ -I./dapl/common -I./dapl/udapl/linux -I./dapl/openib_common -I./dapl/openib_cma -I./dapl/openib_cma/linux -O2  -fexceptions -g -grecord-gcc-switches -pipe -Wall -Werror=format-security -Werror=implicit-function-declaration -Werror=implicit-int -Wp,-U_FORTIFY_SOURCE,-D_FORTIFY_SOURCE=3 -Wp,-D_GLIBCXX_ASSERTIONS -specs=/usr/lib/rpm/redhat/redhat-hardened-cc1 -fstack-protector-strong -specs=/usr/lib/rpm/redhat/redhat-annobin-cc1  -fasynchronous-unwind-tables -fno-omit-frame-pointer  -c -o dapl_udapl_libdaplofa_la-dapl_cno_create.lo `test -f 'dapl/udapl/dapl_cno_create.c' || echo './'`dapl/udapl/dapl_cno_create.c
libtool: compile:  gcc -DHAVE_CONFIG_H -I. -g -Wall -D_GNU_SOURCE -DDAT_CONF=\"/etc/rdma/dat.conf\" -DMPXYD_CONF=\"/etc/rdma/mpxyd.conf\" -DPACKAGE_DATE=20231215 -D_GNU_SOURCE -DOS_RELEASE=393216 -DDAT_EXTENSIONS -DDEFINE_ATTR_LINK_LAYER -DOPENIB -DCQ_WAIT_OBJECT -I./dat/include/ -I./dapl/include/ -I./dapl/common -I./dapl/udapl/linux -I./dapl/openib_common -I./dapl/openib_cma -I./dapl/openib_cma/linux -O2 -fexceptions -g -grecord-gcc-switches -pipe -Wall -Werror=format-security -Werror=implicit-function-declaration -Werror=implicit-int -Wp,-U_FORTIFY_SOURCE,-D_FORTIFY_SOURCE=3 -Wp,-D_GLIBCXX_ASSERTIONS -specs=/usr/lib/rpm/redhat/redhat-hardened-cc1 -fstack-protector-strong -specs=/usr/lib/rpm/redhat/redhat-annobin-cc1 -fasynchronous-unwind-tables -fno-omit-frame-pointer -c dapl/udapl/dapl_init.c  -fPIC -DPIC -o .libs/dapl_udapl_libdaplofa_la-dapl_init.o
libtool: compile:  gcc -DHAVE_CONFIG_H -I. -g -Wall -D_GNU_SOURCE -DDAT_CONF=\"/etc/rdma/dat.conf\" -DMPXYD_CONF=\"/etc/rdma/mpxyd.conf\" -DPACKAGE_DATE=20231215 -D_GNU_SOURCE -DOS_RELEASE=393216 -DDAT_EXTENSIONS -DDEFINE_ATTR_LINK_LAYER -DOPENIB -DCQ_WAIT_OBJECT -I./dat/include/ -I./dapl/include/ -I./dapl/common -I./dapl/udapl/linux -I./dapl/openib_common -I./dapl/openib_cma -I./dapl/openib_cma/linux -O2 -fexceptions -g -grecord-gcc-switches -pipe -Wall -Werror=format-security -Werror=implicit-function-declaration -Werror=implicit-int -Wp,-U_FORTIFY_SOURCE,-D_FORTIFY_SOURCE=3 -Wp,-D_GLIBCXX_ASSERTIONS -specs=/usr/lib/rpm/redhat/redhat-hardened-cc1 -fstack-protector-strong -specs=/usr/lib/rpm/redhat/redhat-annobin-cc1 -fasynchronous-unwind-tables -fno-omit-frame-pointer -c dapl/udapl/dapl_evd_create.c  -fPIC -DPIC -o .libs/dapl_udapl_libdaplofa_la-dapl_evd_create.o
libtool: compile:  gcc -DHAVE_CONFIG_H -I. -g -Wall -D_GNU_SOURCE -DDAT_CONF=\"/etc/rdma/dat.conf\" -DMPXYD_CONF=\"/etc/rdma/mpxyd.conf\" -DPACKAGE_DATE=20231215 -D_GNU_SOURCE -DOS_RELEASE=393216 -DDAT_EXTENSIONS -DDEFINE_ATTR_LINK_LAYER -DOPENIB -DCQ_WAIT_OBJECT -I./dat/include/ -I./dapl/include/ -I./dapl/common -I./dapl/udapl/linux -I./dapl/openib_common -I./dapl/openib_cma -I./dapl/openib_cma/linux -O2 -fexceptions -g -grecord-gcc-switches -pipe -Wall -Werror=format-security -Werror=implicit-function-declaration -Werror=implicit-int -Wp,-U_FORTIFY_SOURCE,-D_FORTIFY_SOURCE=3 -Wp,-D_GLIBCXX_ASSERTIONS -specs=/usr/lib/rpm/redhat/redhat-hardened-cc1 -fstack-protector-strong -specs=/usr/lib/rpm/redhat/redhat-annobin-cc1 -fasynchronous-unwind-tables -fno-omit-frame-pointer -c dapl/udapl/dapl_evd_query.c  -fPIC -DPIC -o .libs/dapl_udapl_libdaplofa_la-dapl_evd_query.o
libtool: compile:  gcc -DHAVE_CONFIG_H -I. -g -Wall -D_GNU_SOURCE -DDAT_CONF=\"/etc/rdma/dat.conf\" -DMPXYD_CONF=\"/etc/rdma/mpxyd.conf\" -DPACKAGE_DATE=20231215 -D_GNU_SOURCE -DOS_RELEASE=393216 -DDAT_EXTENSIONS -DDEFINE_ATTR_LINK_LAYER -DOPENIB -DCQ_WAIT_OBJECT -I./dat/include/ -I./dapl/include/ -I./dapl/common -I./dapl/udapl/linux -I./dapl/openib_common -I./dapl/openib_cma -I./dapl/openib_cma/linux -O2 -fexceptions -g -grecord-gcc-switches -pipe -Wall -Werror=format-security -Werror=implicit-function-declaration -Werror=implicit-int -Wp,-U_FORTIFY_SOURCE,-D_FORTIFY_SOURCE=3 -Wp,-D_GLIBCXX_ASSERTIONS -specs=/usr/lib/rpm/redhat/redhat-hardened-cc1 -fstack-protector-strong -specs=/usr/lib/rpm/redhat/redhat-annobin-cc1 -fasynchronous-unwind-tables -fno-omit-frame-pointer -c dapl/udapl/dapl_cno_create.c  -fPIC -DPIC -o .libs/dapl_udapl_libdaplofa_la-dapl_cno_create.o
In file included from ./dapl/include/dapl.h:53,
                 from dapl/udapl/dapl_init.c:39:
./dapl/udapl/linux/dapl_osd.h:55:2: error: #error UNDEFINED ARCH
   55 | #error UNDEFINED ARCH
      |  ^~~~~
In file included from ./dapl/include/dapl.h:53,
                 from dapl/udapl/dapl_evd_create.c:40:
./dapl/udapl/linux/dapl_osd.h:55:2: error: #error UNDEFINED ARCH
   55 | #error UNDEFINED ARCH
      |  ^~~~~
In file included from ./dapl/include/dapl.h:53,
                 from dapl/udapl/dapl_evd_query.c:39:
./dapl/udapl/linux/dapl_osd.h:55:2: error: #error UNDEFINED ARCH
   55 | #error UNDEFINED ARCH
      |  ^~~~~
In file included from ./dapl/include/dapl.h:53,
                 from dapl/udapl/dapl_cno_create.c:39:
./dapl/udapl/linux/dapl_osd.h:55:2: error: #error UNDEFINED ARCH
   55 | #error UNDEFINED ARCH
      |  ^~~~~
make[2]: *** [Makefile:2704: dapl_udapl_libdaplofa_la-dapl_init.lo] Error 1
make[2]: *** Waiting for unfinished jobs....
make[2]: *** [Makefile:2711: dapl_udapl_libdaplofa_la-dapl_evd_create.lo] Error 1
make[2]: *** [Makefile:2718: dapl_udapl_libdaplofa_la-dapl_evd_query.lo] Error 1
make[2]: *** [Makefile:2725: dapl_udapl_libdaplofa_la-dapl_cno_create.lo] Error 1
make[2]: Leaving directory '/builddir/build/BUILD/dapl-2.1.9'
make[1]: *** [Makefile:6066: all-recursive] Error 1
make[1]: Leaving directory '/builddir/build/BUILD/dapl-2.1.9'
make: *** [Makefile:1907: all] Error 2
error: Bad exit status from /var/tmp/rpm-tmp.NH0Prs (%build)
    Bad exit status from /var/tmp/rpm-tmp.NH0Prs (%build)
RPM build errors:
Child return code was: 1
EXCEPTION: [Error('Command failed: \n # bash --login -c /usr/bin/rpmbuild -bb --noclean --target riscv64 --nodeps /builddir/build/SPECS/dapl.spec\n', 1)]
Traceback (most recent call last):
  File "/usr/lib/python3.11/site-packages/mockbuild/trace_decorator.py", line 93, in trace
    result = func(*args, **kw)
             ^^^^^^^^^^^^^^^^^
  File "/usr/lib/python3.11/site-packages/mockbuild/util.py", line 598, in do_with_status
    raise exception.Error("Command failed: \n # %s\n%s" % (command, output), child.returncode)
mockbuild.exception.Error: Command failed: 
 # bash --login -c /usr/bin/rpmbuild -bb --noclean --target riscv64 --nodeps /builddir/build/SPECS/dapl.spec