Mock Version: 1.4.13
Mock Version: 1.4.13
ENTER ['do'](['bash', '--login', '-c', '/usr/bin/rpmbuild -bs --target riscv64 --nodeps /builddir/build/SPECS/openvdb.spec'], chrootPath='/var/lib/mock/f29-build-33705-18359/root'env={'TERM': 'vt100', 'SHELL': '/bin/bash', 'HOME': '/builddir', 'HOSTNAME': 'mock', 'PATH': '/usr/bin:/bin:/usr/sbin:/sbin', 'PROMPT_COMMAND': 'printf "\\033]0;<mock-chroot>\\007"', 'PS1': '<mock-chroot> \\s-\\v\\$ ', 'LANG': 'en_US.UTF-8'}shell=Falselogger=<mockbuild.trace_decorator.getLog object at 0x200269a978>timeout=345600uid=996gid=135user='mockbuild'nspawn_args=[]unshare_net=TrueprintOutput=False)
Executing command: ['bash', '--login', '-c', '/usr/bin/rpmbuild -bs --target riscv64 --nodeps /builddir/build/SPECS/openvdb.spec'] with env {'TERM': 'vt100', 'SHELL': '/bin/bash', 'HOME': '/builddir', 'HOSTNAME': 'mock', 'PATH': '/usr/bin:/bin:/usr/sbin:/sbin', 'PROMPT_COMMAND': 'printf "\\033]0;<mock-chroot>\\007"', 'PS1': '<mock-chroot> \\s-\\v\\$ ', 'LANG': 'en_US.UTF-8'} and shell False
BUILDSTDERR: sh: line 0: fg: no job control
BUILDSTDERR: sh: line 0: fg: no job control
Building target platforms: riscv64
Building for target riscv64
Wrote: /builddir/build/SRPMS/openvdb-5.1.0-3.fc29.src.rpm
Child return code was: 0
ENTER ['do'](['bash', '--login', '-c', '/usr/bin/rpmbuild -bb --target riscv64 --nodeps /builddir/build/SPECS/openvdb.spec'], chrootPath='/var/lib/mock/f29-build-33705-18359/root'env={'TERM': 'vt100', 'SHELL': '/bin/bash', 'HOME': '/builddir', 'HOSTNAME': 'mock', 'PATH': '/usr/bin:/bin:/usr/sbin:/sbin', 'PROMPT_COMMAND': 'printf "\\033]0;<mock-chroot>\\007"', 'PS1': '<mock-chroot> \\s-\\v\\$ ', 'LANG': 'en_US.UTF-8'}shell=Falselogger=<mockbuild.trace_decorator.getLog object at 0x200269a978>timeout=345600uid=996gid=135user='mockbuild'nspawn_args=[]unshare_net=TrueprintOutput=False)
Executing command: ['bash', '--login', '-c', '/usr/bin/rpmbuild -bb --target riscv64 --nodeps /builddir/build/SPECS/openvdb.spec'] with env {'TERM': 'vt100', 'SHELL': '/bin/bash', 'HOME': '/builddir', 'HOSTNAME': 'mock', 'PATH': '/usr/bin:/bin:/usr/sbin:/sbin', 'PROMPT_COMMAND': 'printf "\\033]0;<mock-chroot>\\007"', 'PS1': '<mock-chroot> \\s-\\v\\$ ', 'LANG': 'en_US.UTF-8'} and shell False
Building target platforms: riscv64
Building for target riscv64
Executing(%prep): /bin/sh -e /var/tmp/rpm-tmp.xqCOGB
+ umask 022
+ cd /builddir/build/BUILD
+ cd /builddir/build/BUILD
+ rm -rf openvdb-5.1.0
+ /usr/bin/gzip -dc /builddir/build/SOURCES/openvdb-5.1.0.tar.gz
+ /usr/bin/tar -xof -
+ STATUS=0
+ '[' 0 -ne 0 ']'
+ cd openvdb-5.1.0
+ /usr/bin/chmod -Rf a+rX,u+w,g-w,o-w .
+ iconv -f iso8859-1 -t utf-8 openvdb/CHANGES
+ mv -f openvdb/CHANGES.conv openvdb/CHANGES
+ sed -i -e 's|lib$|lib64|g' -e 's|lib/python|lib64/python|g' -e 's|REQUIRED COMPONENTS python|REQUIRED COMPONENTS python3|g' openvdb/CMakeLists.txt openvdb/python/CMakeLists.txt
+ cp openvdb/Makefile openvdb/Makefile.docbuild
+ exit 0
Executing(%build): /bin/sh -e /var/tmp/rpm-tmp.1MwJKZ
+ umask 022
+ cd /builddir/build/BUILD
+ cd openvdb-5.1.0
+ export 'CXXFLAGS=-O2 -g -pipe -Wall -Werror=format-security -Wp,-D_FORTIFY_SOURCE=2 -Wp,-D_GLIBCXX_ASSERTIONS -fexceptions -fstack-protector-strong -grecord-gcc-switches -specs=/usr/lib/rpm/redhat/redhat-hardened-cc1 -specs=/usr/lib/rpm/redhat/redhat-annobin-cc1 -fasynchronous-unwind-tables -fstack-clash-protection -Wl,--as-needed'
+ CXXFLAGS='-O2 -g -pipe -Wall -Werror=format-security -Wp,-D_FORTIFY_SOURCE=2 -Wp,-D_GLIBCXX_ASSERTIONS -fexceptions -fstack-protector-strong -grecord-gcc-switches -specs=/usr/lib/rpm/redhat/redhat-hardened-cc1 -specs=/usr/lib/rpm/redhat/redhat-annobin-cc1 -fasynchronous-unwind-tables -fstack-clash-protection -Wl,--as-needed'
+ CFLAGS='-O2 -g -pipe -Wall -Werror=format-security -Wp,-D_FORTIFY_SOURCE=2 -Wp,-D_GLIBCXX_ASSERTIONS -fexceptions -fstack-protector-strong -grecord-gcc-switches -specs=/usr/lib/rpm/redhat/redhat-hardened-cc1 -specs=/usr/lib/rpm/redhat/redhat-annobin-cc1 -fasynchronous-unwind-tables -fstack-clash-protection'
+ export CFLAGS
+ CXXFLAGS='-O2 -g -pipe -Wall -Werror=format-security -Wp,-D_FORTIFY_SOURCE=2 -Wp,-D_GLIBCXX_ASSERTIONS -fexceptions -fstack-protector-strong -grecord-gcc-switches -specs=/usr/lib/rpm/redhat/redhat-hardened-cc1 -specs=/usr/lib/rpm/redhat/redhat-annobin-cc1 -fasynchronous-unwind-tables -fstack-clash-protection -Wl,--as-needed'
+ export CXXFLAGS
+ FFLAGS='-O2 -g -pipe -Wall -Werror=format-security -Wp,-D_FORTIFY_SOURCE=2 -Wp,-D_GLIBCXX_ASSERTIONS -fexceptions -fstack-protector-strong -grecord-gcc-switches -specs=/usr/lib/rpm/redhat/redhat-hardened-cc1 -specs=/usr/lib/rpm/redhat/redhat-annobin-cc1 -fasynchronous-unwind-tables -fstack-clash-protection -I/usr/lib64/gfortran/modules'
+ export FFLAGS
+ FCFLAGS='-O2 -g -pipe -Wall -Werror=format-security -Wp,-D_FORTIFY_SOURCE=2 -Wp,-D_GLIBCXX_ASSERTIONS -fexceptions -fstack-protector-strong -grecord-gcc-switches -specs=/usr/lib/rpm/redhat/redhat-hardened-cc1 -specs=/usr/lib/rpm/redhat/redhat-annobin-cc1 -fasynchronous-unwind-tables -fstack-clash-protection -I/usr/lib64/gfortran/modules'
+ export FCFLAGS
+ LDFLAGS='-Wl,-z,relro   -Wl,-z,now -specs=/usr/lib/rpm/redhat/redhat-hardened-ld'
+ export LDFLAGS
+ /usr/bin/cmake -DCMAKE_C_FLAGS_RELEASE:STRING=-DNDEBUG -DCMAKE_CXX_FLAGS_RELEASE:STRING=-DNDEBUG -DCMAKE_Fortran_FLAGS_RELEASE:STRING=-DNDEBUG -DCMAKE_VERBOSE_MAKEFILE:BOOL=ON -DCMAKE_INSTALL_PREFIX:PATH=/usr -DINCLUDE_INSTALL_DIR:PATH=/usr/include -DLIB_INSTALL_DIR:PATH=/usr/lib64 -DSYSCONF_INSTALL_DIR:PATH=/etc -DSHARE_INSTALL_PREFIX:PATH=/usr/share -DLIB_SUFFIX=64 -DBUILD_SHARED_LIBS:BOOL=ON -DBLOSC_LOCATION=/usr -DCPPUNIT_LOCATION=/usr -DGLEW_LOCATION=/usr -DGLFW3_LOCATION=/usr -DILMBASE_NAMESPACE_VERSIONING=OFF -DILMBASE_LOCATION=/usr -DOPENEXR_LOCATION=/usr -DOPENEXR_NAMESPACE_VERSIONING=OFF -DOPENVDB_ENABLE_RPATH=OFF -DOPENVDB_ABI_VERSION_NUMBER=3 -DPYTHON_VERSION=3.7 -DTBB_LOCATION=/usr -DUSE_GLFW3=True
-- The C compiler identification is GNU 8.2.1
-- The CXX compiler identification is GNU 8.2.1
-- Check for working C compiler: /usr/bin/cc
-- Check for working C compiler: /usr/bin/cc -- works
-- Detecting C compiler ABI info
-- Detecting C compiler ABI info - done
-- Detecting C compile features
-- Detecting C compile features - done
-- Check for working CXX compiler: /usr/bin/c++
-- Check for working CXX compiler: /usr/bin/c++ -- works
-- Detecting CXX compiler ABI info
-- Detecting CXX compiler ABI info - done
-- Detecting CXX compile features
-- Detecting CXX compile features - done
-- Using openvdb abi version 3
-- Found GLFW3: /usr  
-- Looking for pthread.h
-- Looking for pthread.h - found
-- Looking for pthread_create
-- Looking for pthread_create - not found
-- Looking for pthread_create in pthreads
-- Looking for pthread_create in pthreads - not found
-- Looking for pthread_create in pthread
-- Looking for pthread_create in pthread - found
-- Found Threads: TRUE  
-- Boost version: 1.66.0
-- Found the following Boost libraries:
--   iostreams
--   system
--   thread
--   regex
--   chrono
--   date_time
--   atomic
-- Found Blosc: /usr  
-- Found TBB: /usr  
-- Found ZLIB: /usr/lib64/libz.so (found version "1.2.11") 
-- Found ILMBase: /usr  
-- Found OpenEXR: /usr  
-- Found OpenEXR v2.2 at /usr
BUILDSTDERR: CMake Warning (dev) at /usr/share/cmake/Modules/FindOpenGL.cmake:270 (message):
BUILDSTDERR:   Policy CMP0072 is not set: FindOpenGL prefers GLVND by default when
BUILDSTDERR:   available.  Run "cmake --help-policy CMP0072" for policy details.  Use the
BUILDSTDERR:   cmake_policy command to set the policy and suppress this warning.
BUILDSTDERR:   FindOpenGL found both a legacy GL library:
BUILDSTDERR:     OPENGL_gl_LIBRARY: /usr/lib64/libGL.so
BUILDSTDERR:   and GLVND libraries for OpenGL and GLX:
BUILDSTDERR:     OPENGL_opengl_LIBRARY: /usr/lib64/libOpenGL.so
BUILDSTDERR:     OPENGL_glx_LIBRARY: /usr/lib64/libGLX.so
BUILDSTDERR:   OpenGL_GL_PREFERENCE has not been set to "GLVND" or "LEGACY", so for
BUILDSTDERR:   compatibility with CMake 3.10 and below the legacy GL library will be used.
BUILDSTDERR: Call Stack (most recent call first):
BUILDSTDERR:   openvdb/CMakeLists.txt:91 (FIND_PACKAGE)
BUILDSTDERR: This warning is for project developers.  Use -Wno-dev to suppress it.
-- Found OpenGL: /usr/lib64/libOpenGL.so   
-- Found CPPUnit: /usr  
-- Found PythonInterp: /usr/bin/python3.7 (found version "3.7.1") 
-- Found PythonLibs: /usr/lib64/libpython3.7m.so (found version "3.7.1") 
-- Boost version: 1.66.0
-- Found the following Boost libraries:
--   python3
-- Configuring done
-- Generating done
BUILDSTDERR: CMake Warning:
BUILDSTDERR:   Manually-specified variables were not used by the project:
BUILDSTDERR:     CMAKE_CXX_FLAGS_RELEASE
BUILDSTDERR:     CMAKE_C_FLAGS_RELEASE
BUILDSTDERR:     CMAKE_Fortran_FLAGS_RELEASE
BUILDSTDERR:     GLEW_LOCATION
BUILDSTDERR:     INCLUDE_INSTALL_DIR
BUILDSTDERR:     LIB_INSTALL_DIR
BUILDSTDERR:     LIB_SUFFIX
BUILDSTDERR:     PYTHON_VERSION
BUILDSTDERR:     SHARE_INSTALL_PREFIX
BUILDSTDERR:     SYSCONF_INSTALL_DIR
-- Build files have been written to: /builddir/build/BUILD/openvdb-5.1.0
+ /usr/bin/make -O -j4
/usr/bin/cmake -H/builddir/build/BUILD/openvdb-5.1.0 -B/builddir/build/BUILD/openvdb-5.1.0 --check-build-system CMakeFiles/Makefile.cmake 0
/usr/bin/cmake -E cmake_progress_start /builddir/build/BUILD/openvdb-5.1.0/CMakeFiles /builddir/build/BUILD/openvdb-5.1.0/CMakeFiles/progress.marks
/usr/bin/make -f CMakeFiles/Makefile2 all
/usr/bin/make -f openvdb/CMakeFiles/openvdb_shared.dir/build.make openvdb/CMakeFiles/openvdb_shared.dir/depend
/usr/bin/make -f openvdb/CMakeFiles/openvdb_static.dir/build.make openvdb/CMakeFiles/openvdb_static.dir/depend
make[2]: Entering directory '/builddir/build/BUILD/openvdb-5.1.0'
cd /builddir/build/BUILD/openvdb-5.1.0 && /usr/bin/cmake -E cmake_depends "Unix Makefiles" /builddir/build/BUILD/openvdb-5.1.0 /builddir/build/BUILD/openvdb-5.1.0/openvdb /builddir/build/BUILD/openvdb-5.1.0 /builddir/build/BUILD/openvdb-5.1.0/openvdb /builddir/build/BUILD/openvdb-5.1.0/openvdb/CMakeFiles/openvdb_static.dir/DependInfo.cmake --color=
Scanning dependencies of target openvdb_static
make[2]: Leaving directory '/builddir/build/BUILD/openvdb-5.1.0'
/usr/bin/make -f openvdb/CMakeFiles/openvdb_static.dir/build.make openvdb/CMakeFiles/openvdb_static.dir/build
make[2]: Entering directory '/builddir/build/BUILD/openvdb-5.1.0'
cd /builddir/build/BUILD/openvdb-5.1.0 && /usr/bin/cmake -E cmake_depends "Unix Makefiles" /builddir/build/BUILD/openvdb-5.1.0 /builddir/build/BUILD/openvdb-5.1.0/openvdb /builddir/build/BUILD/openvdb-5.1.0 /builddir/build/BUILD/openvdb-5.1.0/openvdb /builddir/build/BUILD/openvdb-5.1.0/openvdb/CMakeFiles/openvdb_shared.dir/DependInfo.cmake --color=
Scanning dependencies of target openvdb_shared
make[2]: Leaving directory '/builddir/build/BUILD/openvdb-5.1.0'
/usr/bin/make -f openvdb/CMakeFiles/openvdb_shared.dir/build.make openvdb/CMakeFiles/openvdb_shared.dir/build
make[2]: Entering directory '/builddir/build/BUILD/openvdb-5.1.0'
[  1%] Building CXX object openvdb/CMakeFiles/openvdb_static.dir/Metadata.cc.o
cd /builddir/build/BUILD/openvdb-5.1.0/openvdb && /usr/bin/c++  -DOPENVDB_ABI_VERSION_NUMBER=3 -I/builddir/build/BUILD/openvdb-5.1.0 -I/builddir/build/BUILD/openvdb-5.1.0/openvdb/. -I/builddir/build/BUILD/openvdb-5.1.0/dwa -isystem /usr/include/OpenEXR  -O2 -g -pipe -Wall -Werror=format-security -Wp,-D_FORTIFY_SOURCE=2 -Wp,-D_GLIBCXX_ASSERTIONS -fexceptions -fstack-protector-strong -grecord-gcc-switches -specs=/usr/lib/rpm/redhat/redhat-hardened-cc1 -specs=/usr/lib/rpm/redhat/redhat-annobin-cc1 -fasynchronous-unwind-tables -fstack-clash-protection -Wl,--as-needed   -pthread -fPIC -std=gnu++11 -DOPENVDB_PRIVATE -DOPENVDB_USE_BLOSC -DOPENVDB_USE_GLFW_3 -o CMakeFiles/openvdb_static.dir/Metadata.cc.o -c /builddir/build/BUILD/openvdb-5.1.0/openvdb/Metadata.cc
make[2]: Leaving directory '/builddir/build/BUILD/openvdb-5.1.0'
make[2]: Entering directory '/builddir/build/BUILD/openvdb-5.1.0'
[  1%] Building CXX object openvdb/CMakeFiles/openvdb_static.dir/MetaMap.cc.o
cd /builddir/build/BUILD/openvdb-5.1.0/openvdb && /usr/bin/c++  -DOPENVDB_ABI_VERSION_NUMBER=3 -I/builddir/build/BUILD/openvdb-5.1.0 -I/builddir/build/BUILD/openvdb-5.1.0/openvdb/. -I/builddir/build/BUILD/openvdb-5.1.0/dwa -isystem /usr/include/OpenEXR  -O2 -g -pipe -Wall -Werror=format-security -Wp,-D_FORTIFY_SOURCE=2 -Wp,-D_GLIBCXX_ASSERTIONS -fexceptions -fstack-protector-strong -grecord-gcc-switches -specs=/usr/lib/rpm/redhat/redhat-hardened-cc1 -specs=/usr/lib/rpm/redhat/redhat-annobin-cc1 -fasynchronous-unwind-tables -fstack-clash-protection -Wl,--as-needed   -pthread -fPIC -std=gnu++11 -DOPENVDB_PRIVATE -DOPENVDB_USE_BLOSC -DOPENVDB_USE_GLFW_3 -o CMakeFiles/openvdb_static.dir/MetaMap.cc.o -c /builddir/build/BUILD/openvdb-5.1.0/openvdb/MetaMap.cc
make[2]: Leaving directory '/builddir/build/BUILD/openvdb-5.1.0'
make[2]: Entering directory '/builddir/build/BUILD/openvdb-5.1.0'
[  2%] Building CXX object openvdb/CMakeFiles/openvdb_shared.dir/MetaMap.cc.o
cd /builddir/build/BUILD/openvdb-5.1.0/openvdb && /usr/bin/c++  -DOPENVDB_ABI_VERSION_NUMBER=3 -Dopenvdb_shared_EXPORTS -I/builddir/build/BUILD/openvdb-5.1.0 -I/builddir/build/BUILD/openvdb-5.1.0/openvdb/. -I/builddir/build/BUILD/openvdb-5.1.0/dwa -isystem /usr/include/OpenEXR  -O2 -g -pipe -Wall -Werror=format-security -Wp,-D_FORTIFY_SOURCE=2 -Wp,-D_GLIBCXX_ASSERTIONS -fexceptions -fstack-protector-strong -grecord-gcc-switches -specs=/usr/lib/rpm/redhat/redhat-hardened-cc1 -specs=/usr/lib/rpm/redhat/redhat-annobin-cc1 -fasynchronous-unwind-tables -fstack-clash-protection -Wl,--as-needed -fPIC   -pthread -fPIC -std=gnu++11 -DOPENVDB_PRIVATE -DOPENVDB_USE_BLOSC -DOPENVDB_USE_GLFW_3 -o CMakeFiles/openvdb_shared.dir/MetaMap.cc.o -c /builddir/build/BUILD/openvdb-5.1.0/openvdb/MetaMap.cc
make[2]: Leaving directory '/builddir/build/BUILD/openvdb-5.1.0'
make[2]: Entering directory '/builddir/build/BUILD/openvdb-5.1.0'
[  2%] Building CXX object openvdb/CMakeFiles/openvdb_shared.dir/Metadata.cc.o
cd /builddir/build/BUILD/openvdb-5.1.0/openvdb && /usr/bin/c++  -DOPENVDB_ABI_VERSION_NUMBER=3 -Dopenvdb_shared_EXPORTS -I/builddir/build/BUILD/openvdb-5.1.0 -I/builddir/build/BUILD/openvdb-5.1.0/openvdb/. -I/builddir/build/BUILD/openvdb-5.1.0/dwa -isystem /usr/include/OpenEXR  -O2 -g -pipe -Wall -Werror=format-security -Wp,-D_FORTIFY_SOURCE=2 -Wp,-D_GLIBCXX_ASSERTIONS -fexceptions -fstack-protector-strong -grecord-gcc-switches -specs=/usr/lib/rpm/redhat/redhat-hardened-cc1 -specs=/usr/lib/rpm/redhat/redhat-annobin-cc1 -fasynchronous-unwind-tables -fstack-clash-protection -Wl,--as-needed -fPIC   -pthread -fPIC -std=gnu++11 -DOPENVDB_PRIVATE -DOPENVDB_USE_BLOSC -DOPENVDB_USE_GLFW_3 -o CMakeFiles/openvdb_shared.dir/Metadata.cc.o -c /builddir/build/BUILD/openvdb-5.1.0/openvdb/Metadata.cc
make[2]: Leaving directory '/builddir/build/BUILD/openvdb-5.1.0'
make[2]: Entering directory '/builddir/build/BUILD/openvdb-5.1.0'
[  0%] Building CXX object openvdb/CMakeFiles/openvdb_static.dir/Grid.cc.o
cd /builddir/build/BUILD/openvdb-5.1.0/openvdb && /usr/bin/c++  -DOPENVDB_ABI_VERSION_NUMBER=3 -I/builddir/build/BUILD/openvdb-5.1.0 -I/builddir/build/BUILD/openvdb-5.1.0/openvdb/. -I/builddir/build/BUILD/openvdb-5.1.0/dwa -isystem /usr/include/OpenEXR  -O2 -g -pipe -Wall -Werror=format-security -Wp,-D_FORTIFY_SOURCE=2 -Wp,-D_GLIBCXX_ASSERTIONS -fexceptions -fstack-protector-strong -grecord-gcc-switches -specs=/usr/lib/rpm/redhat/redhat-hardened-cc1 -specs=/usr/lib/rpm/redhat/redhat-annobin-cc1 -fasynchronous-unwind-tables -fstack-clash-protection -Wl,--as-needed   -pthread -fPIC -std=gnu++11 -DOPENVDB_PRIVATE -DOPENVDB_USE_BLOSC -DOPENVDB_USE_GLFW_3 -o CMakeFiles/openvdb_static.dir/Grid.cc.o -c /builddir/build/BUILD/openvdb-5.1.0/openvdb/Grid.cc
make[2]: Leaving directory '/builddir/build/BUILD/openvdb-5.1.0'
make[2]: Entering directory '/builddir/build/BUILD/openvdb-5.1.0'
[  1%] Building CXX object openvdb/CMakeFiles/openvdb_shared.dir/Grid.cc.o
cd /builddir/build/BUILD/openvdb-5.1.0/openvdb && /usr/bin/c++  -DOPENVDB_ABI_VERSION_NUMBER=3 -Dopenvdb_shared_EXPORTS -I/builddir/build/BUILD/openvdb-5.1.0 -I/builddir/build/BUILD/openvdb-5.1.0/openvdb/. -I/builddir/build/BUILD/openvdb-5.1.0/dwa -isystem /usr/include/OpenEXR  -O2 -g -pipe -Wall -Werror=format-security -Wp,-D_FORTIFY_SOURCE=2 -Wp,-D_GLIBCXX_ASSERTIONS -fexceptions -fstack-protector-strong -grecord-gcc-switches -specs=/usr/lib/rpm/redhat/redhat-hardened-cc1 -specs=/usr/lib/rpm/redhat/redhat-annobin-cc1 -fasynchronous-unwind-tables -fstack-clash-protection -Wl,--as-needed -fPIC   -pthread -fPIC -std=gnu++11 -DOPENVDB_PRIVATE -DOPENVDB_USE_BLOSC -DOPENVDB_USE_GLFW_3 -o CMakeFiles/openvdb_shared.dir/Grid.cc.o -c /builddir/build/BUILD/openvdb-5.1.0/openvdb/Grid.cc
make[2]: Leaving directory '/builddir/build/BUILD/openvdb-5.1.0'
make[2]: Entering directory '/builddir/build/BUILD/openvdb-5.1.0'
[  5%] Building CXX object openvdb/CMakeFiles/openvdb_static.dir/io/Compression.cc.o
cd /builddir/build/BUILD/openvdb-5.1.0/openvdb && /usr/bin/c++  -DOPENVDB_ABI_VERSION_NUMBER=3 -I/builddir/build/BUILD/openvdb-5.1.0 -I/builddir/build/BUILD/openvdb-5.1.0/openvdb/. -I/builddir/build/BUILD/openvdb-5.1.0/dwa -isystem /usr/include/OpenEXR  -O2 -g -pipe -Wall -Werror=format-security -Wp,-D_FORTIFY_SOURCE=2 -Wp,-D_GLIBCXX_ASSERTIONS -fexceptions -fstack-protector-strong -grecord-gcc-switches -specs=/usr/lib/rpm/redhat/redhat-hardened-cc1 -specs=/usr/lib/rpm/redhat/redhat-annobin-cc1 -fasynchronous-unwind-tables -fstack-clash-protection -Wl,--as-needed   -pthread -fPIC -std=gnu++11 -DOPENVDB_PRIVATE -DOPENVDB_USE_BLOSC -DOPENVDB_USE_GLFW_3 -o CMakeFiles/openvdb_static.dir/io/Compression.cc.o -c /builddir/build/BUILD/openvdb-5.1.0/openvdb/io/Compression.cc
make[2]: Leaving directory '/builddir/build/BUILD/openvdb-5.1.0'
make[2]: Entering directory '/builddir/build/BUILD/openvdb-5.1.0'
[  3%] Building CXX object openvdb/CMakeFiles/openvdb_static.dir/Platform.cc.o
cd /builddir/build/BUILD/openvdb-5.1.0/openvdb && /usr/bin/c++  -DOPENVDB_ABI_VERSION_NUMBER=3 -I/builddir/build/BUILD/openvdb-5.1.0 -I/builddir/build/BUILD/openvdb-5.1.0/openvdb/. -I/builddir/build/BUILD/openvdb-5.1.0/dwa -isystem /usr/include/OpenEXR  -O2 -g -pipe -Wall -Werror=format-security -Wp,-D_FORTIFY_SOURCE=2 -Wp,-D_GLIBCXX_ASSERTIONS -fexceptions -fstack-protector-strong -grecord-gcc-switches -specs=/usr/lib/rpm/redhat/redhat-hardened-cc1 -specs=/usr/lib/rpm/redhat/redhat-annobin-cc1 -fasynchronous-unwind-tables -fstack-clash-protection -Wl,--as-needed   -pthread -fPIC -std=gnu++11 -DOPENVDB_PRIVATE -DOPENVDB_USE_BLOSC -DOPENVDB_USE_GLFW_3 -o CMakeFiles/openvdb_static.dir/Platform.cc.o -c /builddir/build/BUILD/openvdb-5.1.0/openvdb/Platform.cc
make[2]: Leaving directory '/builddir/build/BUILD/openvdb-5.1.0'
make[2]: Entering directory '/builddir/build/BUILD/openvdb-5.1.0'
[  5%] Building CXX object openvdb/CMakeFiles/openvdb_shared.dir/Platform.cc.o
cd /builddir/build/BUILD/openvdb-5.1.0/openvdb && /usr/bin/c++  -DOPENVDB_ABI_VERSION_NUMBER=3 -Dopenvdb_shared_EXPORTS -I/builddir/build/BUILD/openvdb-5.1.0 -I/builddir/build/BUILD/openvdb-5.1.0/openvdb/. -I/builddir/build/BUILD/openvdb-5.1.0/dwa -isystem /usr/include/OpenEXR  -O2 -g -pipe -Wall -Werror=format-security -Wp,-D_FORTIFY_SOURCE=2 -Wp,-D_GLIBCXX_ASSERTIONS -fexceptions -fstack-protector-strong -grecord-gcc-switches -specs=/usr/lib/rpm/redhat/redhat-hardened-cc1 -specs=/usr/lib/rpm/redhat/redhat-annobin-cc1 -fasynchronous-unwind-tables -fstack-clash-protection -Wl,--as-needed -fPIC   -pthread -fPIC -std=gnu++11 -DOPENVDB_PRIVATE -DOPENVDB_USE_BLOSC -DOPENVDB_USE_GLFW_3 -o CMakeFiles/openvdb_shared.dir/Platform.cc.o -c /builddir/build/BUILD/openvdb-5.1.0/openvdb/Platform.cc
make[2]: Leaving directory '/builddir/build/BUILD/openvdb-5.1.0'
make[2]: Entering directory '/builddir/build/BUILD/openvdb-5.1.0'
[  6%] Building CXX object openvdb/CMakeFiles/openvdb_shared.dir/io/Compression.cc.o
cd /builddir/build/BUILD/openvdb-5.1.0/openvdb && /usr/bin/c++  -DOPENVDB_ABI_VERSION_NUMBER=3 -Dopenvdb_shared_EXPORTS -I/builddir/build/BUILD/openvdb-5.1.0 -I/builddir/build/BUILD/openvdb-5.1.0/openvdb/. -I/builddir/build/BUILD/openvdb-5.1.0/dwa -isystem /usr/include/OpenEXR  -O2 -g -pipe -Wall -Werror=format-security -Wp,-D_FORTIFY_SOURCE=2 -Wp,-D_GLIBCXX_ASSERTIONS -fexceptions -fstack-protector-strong -grecord-gcc-switches -specs=/usr/lib/rpm/redhat/redhat-hardened-cc1 -specs=/usr/lib/rpm/redhat/redhat-annobin-cc1 -fasynchronous-unwind-tables -fstack-clash-protection -Wl,--as-needed -fPIC   -pthread -fPIC -std=gnu++11 -DOPENVDB_PRIVATE -DOPENVDB_USE_BLOSC -DOPENVDB_USE_GLFW_3 -o CMakeFiles/openvdb_shared.dir/io/Compression.cc.o -c /builddir/build/BUILD/openvdb-5.1.0/openvdb/io/Compression.cc
make[2]: Leaving directory '/builddir/build/BUILD/openvdb-5.1.0'
make[2]: Entering directory '/builddir/build/BUILD/openvdb-5.1.0'
[  4%] Building CXX object openvdb/CMakeFiles/openvdb_static.dir/io/Archive.cc.o
cd /builddir/build/BUILD/openvdb-5.1.0/openvdb && /usr/bin/c++  -DOPENVDB_ABI_VERSION_NUMBER=3 -I/builddir/build/BUILD/openvdb-5.1.0 -I/builddir/build/BUILD/openvdb-5.1.0/openvdb/. -I/builddir/build/BUILD/openvdb-5.1.0/dwa -isystem /usr/include/OpenEXR  -O2 -g -pipe -Wall -Werror=format-security -Wp,-D_FORTIFY_SOURCE=2 -Wp,-D_GLIBCXX_ASSERTIONS -fexceptions -fstack-protector-strong -grecord-gcc-switches -specs=/usr/lib/rpm/redhat/redhat-hardened-cc1 -specs=/usr/lib/rpm/redhat/redhat-annobin-cc1 -fasynchronous-unwind-tables -fstack-clash-protection -Wl,--as-needed   -pthread -fPIC -std=gnu++11 -DOPENVDB_PRIVATE -DOPENVDB_USE_BLOSC -DOPENVDB_USE_GLFW_3 -o CMakeFiles/openvdb_static.dir/io/Archive.cc.o -c /builddir/build/BUILD/openvdb-5.1.0/openvdb/io/Archive.cc
make[2]: Leaving directory '/builddir/build/BUILD/openvdb-5.1.0'
make[2]: Entering directory '/builddir/build/BUILD/openvdb-5.1.0'
[  6%] Building CXX object openvdb/CMakeFiles/openvdb_shared.dir/io/Archive.cc.o
cd /builddir/build/BUILD/openvdb-5.1.0/openvdb && /usr/bin/c++  -DOPENVDB_ABI_VERSION_NUMBER=3 -Dopenvdb_shared_EXPORTS -I/builddir/build/BUILD/openvdb-5.1.0 -I/builddir/build/BUILD/openvdb-5.1.0/openvdb/. -I/builddir/build/BUILD/openvdb-5.1.0/dwa -isystem /usr/include/OpenEXR  -O2 -g -pipe -Wall -Werror=format-security -Wp,-D_FORTIFY_SOURCE=2 -Wp,-D_GLIBCXX_ASSERTIONS -fexceptions -fstack-protector-strong -grecord-gcc-switches -specs=/usr/lib/rpm/redhat/redhat-hardened-cc1 -specs=/usr/lib/rpm/redhat/redhat-annobin-cc1 -fasynchronous-unwind-tables -fstack-clash-protection -Wl,--as-needed -fPIC   -pthread -fPIC -std=gnu++11 -DOPENVDB_PRIVATE -DOPENVDB_USE_BLOSC -DOPENVDB_USE_GLFW_3 -o CMakeFiles/openvdb_shared.dir/io/Archive.cc.o -c /builddir/build/BUILD/openvdb-5.1.0/openvdb/io/Archive.cc
make[2]: Leaving directory '/builddir/build/BUILD/openvdb-5.1.0'
make[2]: Entering directory '/builddir/build/BUILD/openvdb-5.1.0'
[  9%] Building CXX object openvdb/CMakeFiles/openvdb_shared.dir/io/GridDescriptor.cc.o
cd /builddir/build/BUILD/openvdb-5.1.0/openvdb && /usr/bin/c++  -DOPENVDB_ABI_VERSION_NUMBER=3 -Dopenvdb_shared_EXPORTS -I/builddir/build/BUILD/openvdb-5.1.0 -I/builddir/build/BUILD/openvdb-5.1.0/openvdb/. -I/builddir/build/BUILD/openvdb-5.1.0/dwa -isystem /usr/include/OpenEXR  -O2 -g -pipe -Wall -Werror=format-security -Wp,-D_FORTIFY_SOURCE=2 -Wp,-D_GLIBCXX_ASSERTIONS -fexceptions -fstack-protector-strong -grecord-gcc-switches -specs=/usr/lib/rpm/redhat/redhat-hardened-cc1 -specs=/usr/lib/rpm/redhat/redhat-annobin-cc1 -fasynchronous-unwind-tables -fstack-clash-protection -Wl,--as-needed -fPIC   -pthread -fPIC -std=gnu++11 -DOPENVDB_PRIVATE -DOPENVDB_USE_BLOSC -DOPENVDB_USE_GLFW_3 -o CMakeFiles/openvdb_shared.dir/io/GridDescriptor.cc.o -c /builddir/build/BUILD/openvdb-5.1.0/openvdb/io/GridDescriptor.cc
make[2]: Leaving directory '/builddir/build/BUILD/openvdb-5.1.0'
make[2]: Entering directory '/builddir/build/BUILD/openvdb-5.1.0'
[  7%] Building CXX object openvdb/CMakeFiles/openvdb_shared.dir/io/File.cc.o
cd /builddir/build/BUILD/openvdb-5.1.0/openvdb && /usr/bin/c++  -DOPENVDB_ABI_VERSION_NUMBER=3 -Dopenvdb_shared_EXPORTS -I/builddir/build/BUILD/openvdb-5.1.0 -I/builddir/build/BUILD/openvdb-5.1.0/openvdb/. -I/builddir/build/BUILD/openvdb-5.1.0/dwa -isystem /usr/include/OpenEXR  -O2 -g -pipe -Wall -Werror=format-security -Wp,-D_FORTIFY_SOURCE=2 -Wp,-D_GLIBCXX_ASSERTIONS -fexceptions -fstack-protector-strong -grecord-gcc-switches -specs=/usr/lib/rpm/redhat/redhat-hardened-cc1 -specs=/usr/lib/rpm/redhat/redhat-annobin-cc1 -fasynchronous-unwind-tables -fstack-clash-protection -Wl,--as-needed -fPIC   -pthread -fPIC -std=gnu++11 -DOPENVDB_PRIVATE -DOPENVDB_USE_BLOSC -DOPENVDB_USE_GLFW_3 -o CMakeFiles/openvdb_shared.dir/io/File.cc.o -c /builddir/build/BUILD/openvdb-5.1.0/openvdb/io/File.cc
make[2]: Leaving directory '/builddir/build/BUILD/openvdb-5.1.0'
make[2]: Entering directory '/builddir/build/BUILD/openvdb-5.1.0'
[  8%] Building CXX object openvdb/CMakeFiles/openvdb_static.dir/io/File.cc.o
cd /builddir/build/BUILD/openvdb-5.1.0/openvdb && /usr/bin/c++  -DOPENVDB_ABI_VERSION_NUMBER=3 -I/builddir/build/BUILD/openvdb-5.1.0 -I/builddir/build/BUILD/openvdb-5.1.0/openvdb/. -I/builddir/build/BUILD/openvdb-5.1.0/dwa -isystem /usr/include/OpenEXR  -O2 -g -pipe -Wall -Werror=format-security -Wp,-D_FORTIFY_SOURCE=2 -Wp,-D_GLIBCXX_ASSERTIONS -fexceptions -fstack-protector-strong -grecord-gcc-switches -specs=/usr/lib/rpm/redhat/redhat-hardened-cc1 -specs=/usr/lib/rpm/redhat/redhat-annobin-cc1 -fasynchronous-unwind-tables -fstack-clash-protection -Wl,--as-needed   -pthread -fPIC -std=gnu++11 -DOPENVDB_PRIVATE -DOPENVDB_USE_BLOSC -DOPENVDB_USE_GLFW_3 -o CMakeFiles/openvdb_static.dir/io/File.cc.o -c /builddir/build/BUILD/openvdb-5.1.0/openvdb/io/File.cc
make[2]: Leaving directory '/builddir/build/BUILD/openvdb-5.1.0'
make[2]: Entering directory '/builddir/build/BUILD/openvdb-5.1.0'
[ 10%] Building CXX object openvdb/CMakeFiles/openvdb_static.dir/io/GridDescriptor.cc.o
cd /builddir/build/BUILD/openvdb-5.1.0/openvdb && /usr/bin/c++  -DOPENVDB_ABI_VERSION_NUMBER=3 -I/builddir/build/BUILD/openvdb-5.1.0 -I/builddir/build/BUILD/openvdb-5.1.0/openvdb/. -I/builddir/build/BUILD/openvdb-5.1.0/dwa -isystem /usr/include/OpenEXR  -O2 -g -pipe -Wall -Werror=format-security -Wp,-D_FORTIFY_SOURCE=2 -Wp,-D_GLIBCXX_ASSERTIONS -fexceptions -fstack-protector-strong -grecord-gcc-switches -specs=/usr/lib/rpm/redhat/redhat-hardened-cc1 -specs=/usr/lib/rpm/redhat/redhat-annobin-cc1 -fasynchronous-unwind-tables -fstack-clash-protection -Wl,--as-needed   -pthread -fPIC -std=gnu++11 -DOPENVDB_PRIVATE -DOPENVDB_USE_BLOSC -DOPENVDB_USE_GLFW_3 -o CMakeFiles/openvdb_static.dir/io/GridDescriptor.cc.o -c /builddir/build/BUILD/openvdb-5.1.0/openvdb/io/GridDescriptor.cc
make[2]: Leaving directory '/builddir/build/BUILD/openvdb-5.1.0'
make[2]: Entering directory '/builddir/build/BUILD/openvdb-5.1.0'
[ 10%] Building CXX object openvdb/CMakeFiles/openvdb_static.dir/io/Queue.cc.o
cd /builddir/build/BUILD/openvdb-5.1.0/openvdb && /usr/bin/c++  -DOPENVDB_ABI_VERSION_NUMBER=3 -I/builddir/build/BUILD/openvdb-5.1.0 -I/builddir/build/BUILD/openvdb-5.1.0/openvdb/. -I/builddir/build/BUILD/openvdb-5.1.0/dwa -isystem /usr/include/OpenEXR  -O2 -g -pipe -Wall -Werror=format-security -Wp,-D_FORTIFY_SOURCE=2 -Wp,-D_GLIBCXX_ASSERTIONS -fexceptions -fstack-protector-strong -grecord-gcc-switches -specs=/usr/lib/rpm/redhat/redhat-hardened-cc1 -specs=/usr/lib/rpm/redhat/redhat-annobin-cc1 -fasynchronous-unwind-tables -fstack-clash-protection -Wl,--as-needed   -pthread -fPIC -std=gnu++11 -DOPENVDB_PRIVATE -DOPENVDB_USE_BLOSC -DOPENVDB_USE_GLFW_3 -o CMakeFiles/openvdb_static.dir/io/Queue.cc.o -c /builddir/build/BUILD/openvdb-5.1.0/openvdb/io/Queue.cc
make[2]: Leaving directory '/builddir/build/BUILD/openvdb-5.1.0'
make[2]: Entering directory '/builddir/build/BUILD/openvdb-5.1.0'
[ 10%] Building CXX object openvdb/CMakeFiles/openvdb_shared.dir/io/Queue.cc.o
cd /builddir/build/BUILD/openvdb-5.1.0/openvdb && /usr/bin/c++  -DOPENVDB_ABI_VERSION_NUMBER=3 -Dopenvdb_shared_EXPORTS -I/builddir/build/BUILD/openvdb-5.1.0 -I/builddir/build/BUILD/openvdb-5.1.0/openvdb/. -I/builddir/build/BUILD/openvdb-5.1.0/dwa -isystem /usr/include/OpenEXR  -O2 -g -pipe -Wall -Werror=format-security -Wp,-D_FORTIFY_SOURCE=2 -Wp,-D_GLIBCXX_ASSERTIONS -fexceptions -fstack-protector-strong -grecord-gcc-switches -specs=/usr/lib/rpm/redhat/redhat-hardened-cc1 -specs=/usr/lib/rpm/redhat/redhat-annobin-cc1 -fasynchronous-unwind-tables -fstack-clash-protection -Wl,--as-needed -fPIC   -pthread -fPIC -std=gnu++11 -DOPENVDB_PRIVATE -DOPENVDB_USE_BLOSC -DOPENVDB_USE_GLFW_3 -o CMakeFiles/openvdb_shared.dir/io/Queue.cc.o -c /builddir/build/BUILD/openvdb-5.1.0/openvdb/io/Queue.cc
make[2]: Leaving directory '/builddir/build/BUILD/openvdb-5.1.0'
make[2]: Entering directory '/builddir/build/BUILD/openvdb-5.1.0'
[ 11%] Building CXX object openvdb/CMakeFiles/openvdb_static.dir/io/Stream.cc.o
cd /builddir/build/BUILD/openvdb-5.1.0/openvdb && /usr/bin/c++  -DOPENVDB_ABI_VERSION_NUMBER=3 -I/builddir/build/BUILD/openvdb-5.1.0 -I/builddir/build/BUILD/openvdb-5.1.0/openvdb/. -I/builddir/build/BUILD/openvdb-5.1.0/dwa -isystem /usr/include/OpenEXR  -O2 -g -pipe -Wall -Werror=format-security -Wp,-D_FORTIFY_SOURCE=2 -Wp,-D_GLIBCXX_ASSERTIONS -fexceptions -fstack-protector-strong -grecord-gcc-switches -specs=/usr/lib/rpm/redhat/redhat-hardened-cc1 -specs=/usr/lib/rpm/redhat/redhat-annobin-cc1 -fasynchronous-unwind-tables -fstack-clash-protection -Wl,--as-needed   -pthread -fPIC -std=gnu++11 -DOPENVDB_PRIVATE -DOPENVDB_USE_BLOSC -DOPENVDB_USE_GLFW_3 -o CMakeFiles/openvdb_static.dir/io/Stream.cc.o -c /builddir/build/BUILD/openvdb-5.1.0/openvdb/io/Stream.cc
make[2]: Leaving directory '/builddir/build/BUILD/openvdb-5.1.0'
make[2]: Entering directory '/builddir/build/BUILD/openvdb-5.1.0'
[ 13%] Building CXX object openvdb/CMakeFiles/openvdb_shared.dir/io/TempFile.cc.o
cd /builddir/build/BUILD/openvdb-5.1.0/openvdb && /usr/bin/c++  -DOPENVDB_ABI_VERSION_NUMBER=3 -Dopenvdb_shared_EXPORTS -I/builddir/build/BUILD/openvdb-5.1.0 -I/builddir/build/BUILD/openvdb-5.1.0/openvdb/. -I/builddir/build/BUILD/openvdb-5.1.0/dwa -isystem /usr/include/OpenEXR  -O2 -g -pipe -Wall -Werror=format-security -Wp,-D_FORTIFY_SOURCE=2 -Wp,-D_GLIBCXX_ASSERTIONS -fexceptions -fstack-protector-strong -grecord-gcc-switches -specs=/usr/lib/rpm/redhat/redhat-hardened-cc1 -specs=/usr/lib/rpm/redhat/redhat-annobin-cc1 -fasynchronous-unwind-tables -fstack-clash-protection -Wl,--as-needed -fPIC   -pthread -fPIC -std=gnu++11 -DOPENVDB_PRIVATE -DOPENVDB_USE_BLOSC -DOPENVDB_USE_GLFW_3 -o CMakeFiles/openvdb_shared.dir/io/TempFile.cc.o -c /builddir/build/BUILD/openvdb-5.1.0/openvdb/io/TempFile.cc
make[2]: Leaving directory '/builddir/build/BUILD/openvdb-5.1.0'
make[2]: Entering directory '/builddir/build/BUILD/openvdb-5.1.0'
[ 14%] Building CXX object openvdb/CMakeFiles/openvdb_static.dir/io/TempFile.cc.o
cd /builddir/build/BUILD/openvdb-5.1.0/openvdb && /usr/bin/c++  -DOPENVDB_ABI_VERSION_NUMBER=3 -I/builddir/build/BUILD/openvdb-5.1.0 -I/builddir/build/BUILD/openvdb-5.1.0/openvdb/. -I/builddir/build/BUILD/openvdb-5.1.0/dwa -isystem /usr/include/OpenEXR  -O2 -g -pipe -Wall -Werror=format-security -Wp,-D_FORTIFY_SOURCE=2 -Wp,-D_GLIBCXX_ASSERTIONS -fexceptions -fstack-protector-strong -grecord-gcc-switches -specs=/usr/lib/rpm/redhat/redhat-hardened-cc1 -specs=/usr/lib/rpm/redhat/redhat-annobin-cc1 -fasynchronous-unwind-tables -fstack-clash-protection -Wl,--as-needed   -pthread -fPIC -std=gnu++11 -DOPENVDB_PRIVATE -DOPENVDB_USE_BLOSC -DOPENVDB_USE_GLFW_3 -o CMakeFiles/openvdb_static.dir/io/TempFile.cc.o -c /builddir/build/BUILD/openvdb-5.1.0/openvdb/io/TempFile.cc
make[2]: Leaving directory '/builddir/build/BUILD/openvdb-5.1.0'
make[2]: Entering directory '/builddir/build/BUILD/openvdb-5.1.0'
[ 12%] Building CXX object openvdb/CMakeFiles/openvdb_shared.dir/io/Stream.cc.o
cd /builddir/build/BUILD/openvdb-5.1.0/openvdb && /usr/bin/c++  -DOPENVDB_ABI_VERSION_NUMBER=3 -Dopenvdb_shared_EXPORTS -I/builddir/build/BUILD/openvdb-5.1.0 -I/builddir/build/BUILD/openvdb-5.1.0/openvdb/. -I/builddir/build/BUILD/openvdb-5.1.0/dwa -isystem /usr/include/OpenEXR  -O2 -g -pipe -Wall -Werror=format-security -Wp,-D_FORTIFY_SOURCE=2 -Wp,-D_GLIBCXX_ASSERTIONS -fexceptions -fstack-protector-strong -grecord-gcc-switches -specs=/usr/lib/rpm/redhat/redhat-hardened-cc1 -specs=/usr/lib/rpm/redhat/redhat-annobin-cc1 -fasynchronous-unwind-tables -fstack-clash-protection -Wl,--as-needed -fPIC   -pthread -fPIC -std=gnu++11 -DOPENVDB_PRIVATE -DOPENVDB_USE_BLOSC -DOPENVDB_USE_GLFW_3 -o CMakeFiles/openvdb_shared.dir/io/Stream.cc.o -c /builddir/build/BUILD/openvdb-5.1.0/openvdb/io/Stream.cc
make[2]: Leaving directory '/builddir/build/BUILD/openvdb-5.1.0'
make[2]: Entering directory '/builddir/build/BUILD/openvdb-5.1.0'
[ 13%] Building CXX object openvdb/CMakeFiles/openvdb_shared.dir/math/Maps.cc.o
cd /builddir/build/BUILD/openvdb-5.1.0/openvdb && /usr/bin/c++  -DOPENVDB_ABI_VERSION_NUMBER=3 -Dopenvdb_shared_EXPORTS -I/builddir/build/BUILD/openvdb-5.1.0 -I/builddir/build/BUILD/openvdb-5.1.0/openvdb/. -I/builddir/build/BUILD/openvdb-5.1.0/dwa -isystem /usr/include/OpenEXR  -O2 -g -pipe -Wall -Werror=format-security -Wp,-D_FORTIFY_SOURCE=2 -Wp,-D_GLIBCXX_ASSERTIONS -fexceptions -fstack-protector-strong -grecord-gcc-switches -specs=/usr/lib/rpm/redhat/redhat-hardened-cc1 -specs=/usr/lib/rpm/redhat/redhat-annobin-cc1 -fasynchronous-unwind-tables -fstack-clash-protection -Wl,--as-needed -fPIC   -pthread -fPIC -std=gnu++11 -DOPENVDB_PRIVATE -DOPENVDB_USE_BLOSC -DOPENVDB_USE_GLFW_3 -o CMakeFiles/openvdb_shared.dir/math/Maps.cc.o -c /builddir/build/BUILD/openvdb-5.1.0/openvdb/math/Maps.cc
make[2]: Leaving directory '/builddir/build/BUILD/openvdb-5.1.0'
make[2]: Entering directory '/builddir/build/BUILD/openvdb-5.1.0'
[ 15%] Building CXX object openvdb/CMakeFiles/openvdb_shared.dir/math/Proximity.cc.o
cd /builddir/build/BUILD/openvdb-5.1.0/openvdb && /usr/bin/c++  -DOPENVDB_ABI_VERSION_NUMBER=3 -Dopenvdb_shared_EXPORTS -I/builddir/build/BUILD/openvdb-5.1.0 -I/builddir/build/BUILD/openvdb-5.1.0/openvdb/. -I/builddir/build/BUILD/openvdb-5.1.0/dwa -isystem /usr/include/OpenEXR  -O2 -g -pipe -Wall -Werror=format-security -Wp,-D_FORTIFY_SOURCE=2 -Wp,-D_GLIBCXX_ASSERTIONS -fexceptions -fstack-protector-strong -grecord-gcc-switches -specs=/usr/lib/rpm/redhat/redhat-hardened-cc1 -specs=/usr/lib/rpm/redhat/redhat-annobin-cc1 -fasynchronous-unwind-tables -fstack-clash-protection -Wl,--as-needed -fPIC   -pthread -fPIC -std=gnu++11 -DOPENVDB_PRIVATE -DOPENVDB_USE_BLOSC -DOPENVDB_USE_GLFW_3 -o CMakeFiles/openvdb_shared.dir/math/Proximity.cc.o -c /builddir/build/BUILD/openvdb-5.1.0/openvdb/math/Proximity.cc
make[2]: Leaving directory '/builddir/build/BUILD/openvdb-5.1.0'
make[2]: Entering directory '/builddir/build/BUILD/openvdb-5.1.0'
[ 17%] Building CXX object openvdb/CMakeFiles/openvdb_static.dir/math/QuantizedUnitVec.cc.o
cd /builddir/build/BUILD/openvdb-5.1.0/openvdb && /usr/bin/c++  -DOPENVDB_ABI_VERSION_NUMBER=3 -I/builddir/build/BUILD/openvdb-5.1.0 -I/builddir/build/BUILD/openvdb-5.1.0/openvdb/. -I/builddir/build/BUILD/openvdb-5.1.0/dwa -isystem /usr/include/OpenEXR  -O2 -g -pipe -Wall -Werror=format-security -Wp,-D_FORTIFY_SOURCE=2 -Wp,-D_GLIBCXX_ASSERTIONS -fexceptions -fstack-protector-strong -grecord-gcc-switches -specs=/usr/lib/rpm/redhat/redhat-hardened-cc1 -specs=/usr/lib/rpm/redhat/redhat-annobin-cc1 -fasynchronous-unwind-tables -fstack-clash-protection -Wl,--as-needed   -pthread -fPIC -std=gnu++11 -DOPENVDB_PRIVATE -DOPENVDB_USE_BLOSC -DOPENVDB_USE_GLFW_3 -o CMakeFiles/openvdb_static.dir/math/QuantizedUnitVec.cc.o -c /builddir/build/BUILD/openvdb-5.1.0/openvdb/math/QuantizedUnitVec.cc
make[2]: Leaving directory '/builddir/build/BUILD/openvdb-5.1.0'
make[2]: Entering directory '/builddir/build/BUILD/openvdb-5.1.0'
[ 16%] Building CXX object openvdb/CMakeFiles/openvdb_static.dir/math/Proximity.cc.o
cd /builddir/build/BUILD/openvdb-5.1.0/openvdb && /usr/bin/c++  -DOPENVDB_ABI_VERSION_NUMBER=3 -I/builddir/build/BUILD/openvdb-5.1.0 -I/builddir/build/BUILD/openvdb-5.1.0/openvdb/. -I/builddir/build/BUILD/openvdb-5.1.0/dwa -isystem /usr/include/OpenEXR  -O2 -g -pipe -Wall -Werror=format-security -Wp,-D_FORTIFY_SOURCE=2 -Wp,-D_GLIBCXX_ASSERTIONS -fexceptions -fstack-protector-strong -grecord-gcc-switches -specs=/usr/lib/rpm/redhat/redhat-hardened-cc1 -specs=/usr/lib/rpm/redhat/redhat-annobin-cc1 -fasynchronous-unwind-tables -fstack-clash-protection -Wl,--as-needed   -pthread -fPIC -std=gnu++11 -DOPENVDB_PRIVATE -DOPENVDB_USE_BLOSC -DOPENVDB_USE_GLFW_3 -o CMakeFiles/openvdb_static.dir/math/Proximity.cc.o -c /builddir/build/BUILD/openvdb-5.1.0/openvdb/math/Proximity.cc
make[2]: Leaving directory '/builddir/build/BUILD/openvdb-5.1.0'
make[2]: Entering directory '/builddir/build/BUILD/openvdb-5.1.0'
[ 17%] Building CXX object openvdb/CMakeFiles/openvdb_shared.dir/math/QuantizedUnitVec.cc.o
cd /builddir/build/BUILD/openvdb-5.1.0/openvdb && /usr/bin/c++  -DOPENVDB_ABI_VERSION_NUMBER=3 -Dopenvdb_shared_EXPORTS -I/builddir/build/BUILD/openvdb-5.1.0 -I/builddir/build/BUILD/openvdb-5.1.0/openvdb/. -I/builddir/build/BUILD/openvdb-5.1.0/dwa -isystem /usr/include/OpenEXR  -O2 -g -pipe -Wall -Werror=format-security -Wp,-D_FORTIFY_SOURCE=2 -Wp,-D_GLIBCXX_ASSERTIONS -fexceptions -fstack-protector-strong -grecord-gcc-switches -specs=/usr/lib/rpm/redhat/redhat-hardened-cc1 -specs=/usr/lib/rpm/redhat/redhat-annobin-cc1 -fasynchronous-unwind-tables -fstack-clash-protection -Wl,--as-needed -fPIC   -pthread -fPIC -std=gnu++11 -DOPENVDB_PRIVATE -DOPENVDB_USE_BLOSC -DOPENVDB_USE_GLFW_3 -o CMakeFiles/openvdb_shared.dir/math/QuantizedUnitVec.cc.o -c /builddir/build/BUILD/openvdb-5.1.0/openvdb/math/QuantizedUnitVec.cc
make[2]: Leaving directory '/builddir/build/BUILD/openvdb-5.1.0'
make[2]: Entering directory '/builddir/build/BUILD/openvdb-5.1.0'
[ 14%] Building CXX object openvdb/CMakeFiles/openvdb_static.dir/math/Maps.cc.o
cd /builddir/build/BUILD/openvdb-5.1.0/openvdb && /usr/bin/c++  -DOPENVDB_ABI_VERSION_NUMBER=3 -I/builddir/build/BUILD/openvdb-5.1.0 -I/builddir/build/BUILD/openvdb-5.1.0/openvdb/. -I/builddir/build/BUILD/openvdb-5.1.0/dwa -isystem /usr/include/OpenEXR  -O2 -g -pipe -Wall -Werror=format-security -Wp,-D_FORTIFY_SOURCE=2 -Wp,-D_GLIBCXX_ASSERTIONS -fexceptions -fstack-protector-strong -grecord-gcc-switches -specs=/usr/lib/rpm/redhat/redhat-hardened-cc1 -specs=/usr/lib/rpm/redhat/redhat-annobin-cc1 -fasynchronous-unwind-tables -fstack-clash-protection -Wl,--as-needed   -pthread -fPIC -std=gnu++11 -DOPENVDB_PRIVATE -DOPENVDB_USE_BLOSC -DOPENVDB_USE_GLFW_3 -o CMakeFiles/openvdb_static.dir/math/Maps.cc.o -c /builddir/build/BUILD/openvdb-5.1.0/openvdb/math/Maps.cc
make[2]: Leaving directory '/builddir/build/BUILD/openvdb-5.1.0'
make[2]: Entering directory '/builddir/build/BUILD/openvdb-5.1.0'
[ 19%] Building CXX object openvdb/CMakeFiles/openvdb_shared.dir/points/AttributeArray.cc.o
cd /builddir/build/BUILD/openvdb-5.1.0/openvdb && /usr/bin/c++  -DOPENVDB_ABI_VERSION_NUMBER=3 -Dopenvdb_shared_EXPORTS -I/builddir/build/BUILD/openvdb-5.1.0 -I/builddir/build/BUILD/openvdb-5.1.0/openvdb/. -I/builddir/build/BUILD/openvdb-5.1.0/dwa -isystem /usr/include/OpenEXR  -O2 -g -pipe -Wall -Werror=format-security -Wp,-D_FORTIFY_SOURCE=2 -Wp,-D_GLIBCXX_ASSERTIONS -fexceptions -fstack-protector-strong -grecord-gcc-switches -specs=/usr/lib/rpm/redhat/redhat-hardened-cc1 -specs=/usr/lib/rpm/redhat/redhat-annobin-cc1 -fasynchronous-unwind-tables -fstack-clash-protection -Wl,--as-needed -fPIC   -pthread -fPIC -std=gnu++11 -DOPENVDB_PRIVATE -DOPENVDB_USE_BLOSC -DOPENVDB_USE_GLFW_3 -o CMakeFiles/openvdb_shared.dir/points/AttributeArray.cc.o -c /builddir/build/BUILD/openvdb-5.1.0/openvdb/points/AttributeArray.cc
make[2]: Leaving directory '/builddir/build/BUILD/openvdb-5.1.0'
make[2]: Entering directory '/builddir/build/BUILD/openvdb-5.1.0'
[ 20%] Building CXX object openvdb/CMakeFiles/openvdb_static.dir/points/AttributeArray.cc.o
cd /builddir/build/BUILD/openvdb-5.1.0/openvdb && /usr/bin/c++  -DOPENVDB_ABI_VERSION_NUMBER=3 -I/builddir/build/BUILD/openvdb-5.1.0 -I/builddir/build/BUILD/openvdb-5.1.0/openvdb/. -I/builddir/build/BUILD/openvdb-5.1.0/dwa -isystem /usr/include/OpenEXR  -O2 -g -pipe -Wall -Werror=format-security -Wp,-D_FORTIFY_SOURCE=2 -Wp,-D_GLIBCXX_ASSERTIONS -fexceptions -fstack-protector-strong -grecord-gcc-switches -specs=/usr/lib/rpm/redhat/redhat-hardened-cc1 -specs=/usr/lib/rpm/redhat/redhat-annobin-cc1 -fasynchronous-unwind-tables -fstack-clash-protection -Wl,--as-needed   -pthread -fPIC -std=gnu++11 -DOPENVDB_PRIVATE -DOPENVDB_USE_BLOSC -DOPENVDB_USE_GLFW_3 -o CMakeFiles/openvdb_static.dir/points/AttributeArray.cc.o -c /builddir/build/BUILD/openvdb-5.1.0/openvdb/points/AttributeArray.cc
make[2]: Leaving directory '/builddir/build/BUILD/openvdb-5.1.0'
make[2]: Entering directory '/builddir/build/BUILD/openvdb-5.1.0'
[ 19%] Building CXX object openvdb/CMakeFiles/openvdb_shared.dir/points/AttributeArrayString.cc.o
cd /builddir/build/BUILD/openvdb-5.1.0/openvdb && /usr/bin/c++  -DOPENVDB_ABI_VERSION_NUMBER=3 -Dopenvdb_shared_EXPORTS -I/builddir/build/BUILD/openvdb-5.1.0 -I/builddir/build/BUILD/openvdb-5.1.0/openvdb/. -I/builddir/build/BUILD/openvdb-5.1.0/dwa -isystem /usr/include/OpenEXR  -O2 -g -pipe -Wall -Werror=format-security -Wp,-D_FORTIFY_SOURCE=2 -Wp,-D_GLIBCXX_ASSERTIONS -fexceptions -fstack-protector-strong -grecord-gcc-switches -specs=/usr/lib/rpm/redhat/redhat-hardened-cc1 -specs=/usr/lib/rpm/redhat/redhat-annobin-cc1 -fasynchronous-unwind-tables -fstack-clash-protection -Wl,--as-needed -fPIC   -pthread -fPIC -std=gnu++11 -DOPENVDB_PRIVATE -DOPENVDB_USE_BLOSC -DOPENVDB_USE_GLFW_3 -o CMakeFiles/openvdb_shared.dir/points/AttributeArrayString.cc.o -c /builddir/build/BUILD/openvdb-5.1.0/openvdb/points/AttributeArrayString.cc
make[2]: Leaving directory '/builddir/build/BUILD/openvdb-5.1.0'
make[2]: Entering directory '/builddir/build/BUILD/openvdb-5.1.0'
[ 18%] Building CXX object openvdb/CMakeFiles/openvdb_shared.dir/math/Transform.cc.o
cd /builddir/build/BUILD/openvdb-5.1.0/openvdb && /usr/bin/c++  -DOPENVDB_ABI_VERSION_NUMBER=3 -Dopenvdb_shared_EXPORTS -I/builddir/build/BUILD/openvdb-5.1.0 -I/builddir/build/BUILD/openvdb-5.1.0/openvdb/. -I/builddir/build/BUILD/openvdb-5.1.0/dwa -isystem /usr/include/OpenEXR  -O2 -g -pipe -Wall -Werror=format-security -Wp,-D_FORTIFY_SOURCE=2 -Wp,-D_GLIBCXX_ASSERTIONS -fexceptions -fstack-protector-strong -grecord-gcc-switches -specs=/usr/lib/rpm/redhat/redhat-hardened-cc1 -specs=/usr/lib/rpm/redhat/redhat-annobin-cc1 -fasynchronous-unwind-tables -fstack-clash-protection -Wl,--as-needed -fPIC   -pthread -fPIC -std=gnu++11 -DOPENVDB_PRIVATE -DOPENVDB_USE_BLOSC -DOPENVDB_USE_GLFW_3 -o CMakeFiles/openvdb_shared.dir/math/Transform.cc.o -c /builddir/build/BUILD/openvdb-5.1.0/openvdb/math/Transform.cc
make[2]: Leaving directory '/builddir/build/BUILD/openvdb-5.1.0'
make[2]: Entering directory '/builddir/build/BUILD/openvdb-5.1.0'
[ 19%] Building CXX object openvdb/CMakeFiles/openvdb_static.dir/math/Transform.cc.o
cd /builddir/build/BUILD/openvdb-5.1.0/openvdb && /usr/bin/c++  -DOPENVDB_ABI_VERSION_NUMBER=3 -I/builddir/build/BUILD/openvdb-5.1.0 -I/builddir/build/BUILD/openvdb-5.1.0/openvdb/. -I/builddir/build/BUILD/openvdb-5.1.0/dwa -isystem /usr/include/OpenEXR  -O2 -g -pipe -Wall -Werror=format-security -Wp,-D_FORTIFY_SOURCE=2 -Wp,-D_GLIBCXX_ASSERTIONS -fexceptions -fstack-protector-strong -grecord-gcc-switches -specs=/usr/lib/rpm/redhat/redhat-hardened-cc1 -specs=/usr/lib/rpm/redhat/redhat-annobin-cc1 -fasynchronous-unwind-tables -fstack-clash-protection -Wl,--as-needed   -pthread -fPIC -std=gnu++11 -DOPENVDB_PRIVATE -DOPENVDB_USE_BLOSC -DOPENVDB_USE_GLFW_3 -o CMakeFiles/openvdb_static.dir/math/Transform.cc.o -c /builddir/build/BUILD/openvdb-5.1.0/openvdb/math/Transform.cc
make[2]: Leaving directory '/builddir/build/BUILD/openvdb-5.1.0'
make[2]: Entering directory '/builddir/build/BUILD/openvdb-5.1.0'
[ 21%] Building CXX object openvdb/CMakeFiles/openvdb_shared.dir/points/AttributeGroup.cc.o
cd /builddir/build/BUILD/openvdb-5.1.0/openvdb && /usr/bin/c++  -DOPENVDB_ABI_VERSION_NUMBER=3 -Dopenvdb_shared_EXPORTS -I/builddir/build/BUILD/openvdb-5.1.0 -I/builddir/build/BUILD/openvdb-5.1.0/openvdb/. -I/builddir/build/BUILD/openvdb-5.1.0/dwa -isystem /usr/include/OpenEXR  -O2 -g -pipe -Wall -Werror=format-security -Wp,-D_FORTIFY_SOURCE=2 -Wp,-D_GLIBCXX_ASSERTIONS -fexceptions -fstack-protector-strong -grecord-gcc-switches -specs=/usr/lib/rpm/redhat/redhat-hardened-cc1 -specs=/usr/lib/rpm/redhat/redhat-annobin-cc1 -fasynchronous-unwind-tables -fstack-clash-protection -Wl,--as-needed -fPIC   -pthread -fPIC -std=gnu++11 -DOPENVDB_PRIVATE -DOPENVDB_USE_BLOSC -DOPENVDB_USE_GLFW_3 -o CMakeFiles/openvdb_shared.dir/points/AttributeGroup.cc.o -c /builddir/build/BUILD/openvdb-5.1.0/openvdb/points/AttributeGroup.cc
make[2]: Leaving directory '/builddir/build/BUILD/openvdb-5.1.0'
make[2]: Entering directory '/builddir/build/BUILD/openvdb-5.1.0'
[ 22%] Building CXX object openvdb/CMakeFiles/openvdb_static.dir/points/AttributeGroup.cc.o
cd /builddir/build/BUILD/openvdb-5.1.0/openvdb && /usr/bin/c++  -DOPENVDB_ABI_VERSION_NUMBER=3 -I/builddir/build/BUILD/openvdb-5.1.0 -I/builddir/build/BUILD/openvdb-5.1.0/openvdb/. -I/builddir/build/BUILD/openvdb-5.1.0/dwa -isystem /usr/include/OpenEXR  -O2 -g -pipe -Wall -Werror=format-security -Wp,-D_FORTIFY_SOURCE=2 -Wp,-D_GLIBCXX_ASSERTIONS -fexceptions -fstack-protector-strong -grecord-gcc-switches -specs=/usr/lib/rpm/redhat/redhat-hardened-cc1 -specs=/usr/lib/rpm/redhat/redhat-annobin-cc1 -fasynchronous-unwind-tables -fstack-clash-protection -Wl,--as-needed   -pthread -fPIC -std=gnu++11 -DOPENVDB_PRIVATE -DOPENVDB_USE_BLOSC -DOPENVDB_USE_GLFW_3 -o CMakeFiles/openvdb_static.dir/points/AttributeGroup.cc.o -c /builddir/build/BUILD/openvdb-5.1.0/openvdb/points/AttributeGroup.cc
make[2]: Leaving directory '/builddir/build/BUILD/openvdb-5.1.0'
make[2]: Entering directory '/builddir/build/BUILD/openvdb-5.1.0'
[ 21%] Building CXX object openvdb/CMakeFiles/openvdb_static.dir/points/AttributeArrayString.cc.o
cd /builddir/build/BUILD/openvdb-5.1.0/openvdb && /usr/bin/c++  -DOPENVDB_ABI_VERSION_NUMBER=3 -I/builddir/build/BUILD/openvdb-5.1.0 -I/builddir/build/BUILD/openvdb-5.1.0/openvdb/. -I/builddir/build/BUILD/openvdb-5.1.0/dwa -isystem /usr/include/OpenEXR  -O2 -g -pipe -Wall -Werror=format-security -Wp,-D_FORTIFY_SOURCE=2 -Wp,-D_GLIBCXX_ASSERTIONS -fexceptions -fstack-protector-strong -grecord-gcc-switches -specs=/usr/lib/rpm/redhat/redhat-hardened-cc1 -specs=/usr/lib/rpm/redhat/redhat-annobin-cc1 -fasynchronous-unwind-tables -fstack-clash-protection -Wl,--as-needed   -pthread -fPIC -std=gnu++11 -DOPENVDB_PRIVATE -DOPENVDB_USE_BLOSC -DOPENVDB_USE_GLFW_3 -o CMakeFiles/openvdb_static.dir/points/AttributeArrayString.cc.o -c /builddir/build/BUILD/openvdb-5.1.0/openvdb/points/AttributeArrayString.cc
make[2]: Leaving directory '/builddir/build/BUILD/openvdb-5.1.0'
make[2]: Entering directory '/builddir/build/BUILD/openvdb-5.1.0'
[ 24%] Building CXX object openvdb/CMakeFiles/openvdb_shared.dir/points/StreamCompression.cc.o
cd /builddir/build/BUILD/openvdb-5.1.0/openvdb && /usr/bin/c++  -DOPENVDB_ABI_VERSION_NUMBER=3 -Dopenvdb_shared_EXPORTS -I/builddir/build/BUILD/openvdb-5.1.0 -I/builddir/build/BUILD/openvdb-5.1.0/openvdb/. -I/builddir/build/BUILD/openvdb-5.1.0/dwa -isystem /usr/include/OpenEXR  -O2 -g -pipe -Wall -Werror=format-security -Wp,-D_FORTIFY_SOURCE=2 -Wp,-D_GLIBCXX_ASSERTIONS -fexceptions -fstack-protector-strong -grecord-gcc-switches -specs=/usr/lib/rpm/redhat/redhat-hardened-cc1 -specs=/usr/lib/rpm/redhat/redhat-annobin-cc1 -fasynchronous-unwind-tables -fstack-clash-protection -Wl,--as-needed -fPIC   -pthread -fPIC -std=gnu++11 -DOPENVDB_PRIVATE -DOPENVDB_USE_BLOSC -DOPENVDB_USE_GLFW_3 -o CMakeFiles/openvdb_shared.dir/points/StreamCompression.cc.o -c /builddir/build/BUILD/openvdb-5.1.0/openvdb/points/StreamCompression.cc
make[2]: Leaving directory '/builddir/build/BUILD/openvdb-5.1.0'
make[2]: Entering directory '/builddir/build/BUILD/openvdb-5.1.0'
[ 23%] Building CXX object openvdb/CMakeFiles/openvdb_shared.dir/points/AttributeSet.cc.o
cd /builddir/build/BUILD/openvdb-5.1.0/openvdb && /usr/bin/c++  -DOPENVDB_ABI_VERSION_NUMBER=3 -Dopenvdb_shared_EXPORTS -I/builddir/build/BUILD/openvdb-5.1.0 -I/builddir/build/BUILD/openvdb-5.1.0/openvdb/. -I/builddir/build/BUILD/openvdb-5.1.0/dwa -isystem /usr/include/OpenEXR  -O2 -g -pipe -Wall -Werror=format-security -Wp,-D_FORTIFY_SOURCE=2 -Wp,-D_GLIBCXX_ASSERTIONS -fexceptions -fstack-protector-strong -grecord-gcc-switches -specs=/usr/lib/rpm/redhat/redhat-hardened-cc1 -specs=/usr/lib/rpm/redhat/redhat-annobin-cc1 -fasynchronous-unwind-tables -fstack-clash-protection -Wl,--as-needed -fPIC   -pthread -fPIC -std=gnu++11 -DOPENVDB_PRIVATE -DOPENVDB_USE_BLOSC -DOPENVDB_USE_GLFW_3 -o CMakeFiles/openvdb_shared.dir/points/AttributeSet.cc.o -c /builddir/build/BUILD/openvdb-5.1.0/openvdb/points/AttributeSet.cc
make[2]: Leaving directory '/builddir/build/BUILD/openvdb-5.1.0'
make[2]: Entering directory '/builddir/build/BUILD/openvdb-5.1.0'
[ 25%] Building CXX object openvdb/CMakeFiles/openvdb_static.dir/points/StreamCompression.cc.o
cd /builddir/build/BUILD/openvdb-5.1.0/openvdb && /usr/bin/c++  -DOPENVDB_ABI_VERSION_NUMBER=3 -I/builddir/build/BUILD/openvdb-5.1.0 -I/builddir/build/BUILD/openvdb-5.1.0/openvdb/. -I/builddir/build/BUILD/openvdb-5.1.0/dwa -isystem /usr/include/OpenEXR  -O2 -g -pipe -Wall -Werror=format-security -Wp,-D_FORTIFY_SOURCE=2 -Wp,-D_GLIBCXX_ASSERTIONS -fexceptions -fstack-protector-strong -grecord-gcc-switches -specs=/usr/lib/rpm/redhat/redhat-hardened-cc1 -specs=/usr/lib/rpm/redhat/redhat-annobin-cc1 -fasynchronous-unwind-tables -fstack-clash-protection -Wl,--as-needed   -pthread -fPIC -std=gnu++11 -DOPENVDB_PRIVATE -DOPENVDB_USE_BLOSC -DOPENVDB_USE_GLFW_3 -o CMakeFiles/openvdb_static.dir/points/StreamCompression.cc.o -c /builddir/build/BUILD/openvdb-5.1.0/openvdb/points/StreamCompression.cc
make[2]: Leaving directory '/builddir/build/BUILD/openvdb-5.1.0'
make[2]: Entering directory '/builddir/build/BUILD/openvdb-5.1.0'
[ 24%] Building CXX object openvdb/CMakeFiles/openvdb_static.dir/points/AttributeSet.cc.o
cd /builddir/build/BUILD/openvdb-5.1.0/openvdb && /usr/bin/c++  -DOPENVDB_ABI_VERSION_NUMBER=3 -I/builddir/build/BUILD/openvdb-5.1.0 -I/builddir/build/BUILD/openvdb-5.1.0/openvdb/. -I/builddir/build/BUILD/openvdb-5.1.0/dwa -isystem /usr/include/OpenEXR  -O2 -g -pipe -Wall -Werror=format-security -Wp,-D_FORTIFY_SOURCE=2 -Wp,-D_GLIBCXX_ASSERTIONS -fexceptions -fstack-protector-strong -grecord-gcc-switches -specs=/usr/lib/rpm/redhat/redhat-hardened-cc1 -specs=/usr/lib/rpm/redhat/redhat-annobin-cc1 -fasynchronous-unwind-tables -fstack-clash-protection -Wl,--as-needed   -pthread -fPIC -std=gnu++11 -DOPENVDB_PRIVATE -DOPENVDB_USE_BLOSC -DOPENVDB_USE_GLFW_3 -o CMakeFiles/openvdb_static.dir/points/AttributeSet.cc.o -c /builddir/build/BUILD/openvdb-5.1.0/openvdb/points/AttributeSet.cc
make[2]: Leaving directory '/builddir/build/BUILD/openvdb-5.1.0'
make[2]: Entering directory '/builddir/build/BUILD/openvdb-5.1.0'
[ 26%] Building CXX object openvdb/CMakeFiles/openvdb_static.dir/points/points.cc.o
cd /builddir/build/BUILD/openvdb-5.1.0/openvdb && /usr/bin/c++  -DOPENVDB_ABI_VERSION_NUMBER=3 -I/builddir/build/BUILD/openvdb-5.1.0 -I/builddir/build/BUILD/openvdb-5.1.0/openvdb/. -I/builddir/build/BUILD/openvdb-5.1.0/dwa -isystem /usr/include/OpenEXR  -O2 -g -pipe -Wall -Werror=format-security -Wp,-D_FORTIFY_SOURCE=2 -Wp,-D_GLIBCXX_ASSERTIONS -fexceptions -fstack-protector-strong -grecord-gcc-switches -specs=/usr/lib/rpm/redhat/redhat-hardened-cc1 -specs=/usr/lib/rpm/redhat/redhat-annobin-cc1 -fasynchronous-unwind-tables -fstack-clash-protection -Wl,--as-needed   -pthread -fPIC -std=gnu++11 -DOPENVDB_PRIVATE -DOPENVDB_USE_BLOSC -DOPENVDB_USE_GLFW_3 -o CMakeFiles/openvdb_static.dir/points/points.cc.o -c /builddir/build/BUILD/openvdb-5.1.0/openvdb/points/points.cc
make[2]: Leaving directory '/builddir/build/BUILD/openvdb-5.1.0'
BUILDSTDERR: In file included from /builddir/build/BUILD/openvdb-5.1.0/openvdb/points/PointDataGrid.h:47,
BUILDSTDERR:                  from /builddir/build/BUILD/openvdb-5.1.0/openvdb/points/points.cc:33:
BUILDSTDERR: /builddir/build/BUILD/openvdb-5.1.0/openvdb/points/AttributeArray.h: In instantiation of 'openvdb::v5_1abi3::points::TypedAttributeArray<ValueType_, Codec_>::TypedAttributeArray(const openvdb::v5_1abi3::points::TypedAttributeArray<ValueType_, Codec_>&, bool) [with ValueType_ = openvdb::v5_1abi3::math::Vec3<float>; Codec_ = openvdb::v5_1abi3::points::FixedPointCodec<false, openvdb::v5_1abi3::points::UnitRange>]':
BUILDSTDERR: /builddir/build/BUILD/openvdb-5.1.0/openvdb/points/AttributeArray.h:1010:32:   required from 'openvdb::v5_1abi3::points::AttributeArray::Ptr openvdb::v5_1abi3::points::TypedAttributeArray<ValueType_, Codec_>::copy() const [with ValueType_ = openvdb::v5_1abi3::math::Vec3<float>; Codec_ = openvdb::v5_1abi3::points::FixedPointCodec<false, openvdb::v5_1abi3::points::UnitRange>; openvdb::v5_1abi3::points::AttributeArray::Ptr = std::shared_ptr<openvdb::v5_1abi3::points::AttributeArray>]'
BUILDSTDERR: /builddir/build/BUILD/openvdb-5.1.0/openvdb/points/AttributeArray.h:1008:1:   required from here
BUILDSTDERR: /builddir/build/BUILD/openvdb-5.1.0/openvdb/points/AttributeArray.h:905:20: warning: 'void* memcpy(void*, const void*, size_t)' writing to an object of type 'class openvdb::v5_1abi3::math::Vec3<short unsigned int>' with no trivial copy-assignment; use copy-assignment or copy-initialization instead [-Wclass-memaccess]
BUILDSTDERR:          std::memcpy(mData.get(), rhs.mData.get(), this->arrayMemUsage());
BUILDSTDERR:          ~~~~~~~~~~~^~~~~~~~~~~~~~~~~~~~~~~~~~~~~~~~~~~~~~~~~~~~~~~~~~~~~
BUILDSTDERR: In file included from /builddir/build/BUILD/openvdb-5.1.0/openvdb/math/BBox.h:35,
BUILDSTDERR:                  from /builddir/build/BUILD/openvdb-5.1.0/openvdb/Types.h:38,
BUILDSTDERR:                  from /builddir/build/BUILD/openvdb-5.1.0/openvdb/Metadata.h:36,
BUILDSTDERR:                  from /builddir/build/BUILD/openvdb-5.1.0/openvdb/MetaMap.h:34,
BUILDSTDERR:                  from /builddir/build/BUILD/openvdb-5.1.0/openvdb/Grid.h:35,
BUILDSTDERR:                  from /builddir/build/BUILD/openvdb-5.1.0/openvdb/points/PointDataGrid.h:43,
BUILDSTDERR:                  from /builddir/build/BUILD/openvdb-5.1.0/openvdb/points/points.cc:33:
BUILDSTDERR: /builddir/build/BUILD/openvdb-5.1.0/openvdb/math/Vec3.h:50:7: note: 'class openvdb::v5_1abi3::math::Vec3<short unsigned int>' declared here
BUILDSTDERR:  class Vec3: public Tuple<3, T>
BUILDSTDERR:        ^~~~
BUILDSTDERR: In file included from /builddir/build/BUILD/openvdb-5.1.0/openvdb/points/PointDataGrid.h:47,
BUILDSTDERR:                  from /builddir/build/BUILD/openvdb-5.1.0/openvdb/points/points.cc:33:
BUILDSTDERR: /builddir/build/BUILD/openvdb-5.1.0/openvdb/points/AttributeArray.h: In instantiation of 'openvdb::v5_1abi3::points::TypedAttributeArray<ValueType_, Codec_>::TypedAttributeArray(const openvdb::v5_1abi3::points::TypedAttributeArray<ValueType_, Codec_>&, bool) [with ValueType_ = openvdb::v5_1abi3::math::Vec3<float>; Codec_ = openvdb::v5_1abi3::points::FixedPointCodec<true, openvdb::v5_1abi3::points::UnitRange>]':
BUILDSTDERR: /builddir/build/BUILD/openvdb-5.1.0/openvdb/points/AttributeArray.h:1010:32:   required from 'openvdb::v5_1abi3::points::AttributeArray::Ptr openvdb::v5_1abi3::points::TypedAttributeArray<ValueType_, Codec_>::copy() const [with ValueType_ = openvdb::v5_1abi3::math::Vec3<float>; Codec_ = openvdb::v5_1abi3::points::FixedPointCodec<true, openvdb::v5_1abi3::points::UnitRange>; openvdb::v5_1abi3::points::AttributeArray::Ptr = std::shared_ptr<openvdb::v5_1abi3::points::AttributeArray>]'
BUILDSTDERR: /builddir/build/BUILD/openvdb-5.1.0/openvdb/points/AttributeArray.h:1008:1:   required from here
BUILDSTDERR: /builddir/build/BUILD/openvdb-5.1.0/openvdb/points/AttributeArray.h:905:20: warning: 'void* memcpy(void*, const void*, size_t)' writing to an object of type 'class openvdb::v5_1abi3::math::Vec3<unsigned char>' with no trivial copy-assignment; use copy-assignment or copy-initialization instead [-Wclass-memaccess]
BUILDSTDERR:          std::memcpy(mData.get(), rhs.mData.get(), this->arrayMemUsage());
BUILDSTDERR:          ~~~~~~~~~~~^~~~~~~~~~~~~~~~~~~~~~~~~~~~~~~~~~~~~~~~~~~~~~~~~~~~~
BUILDSTDERR: In file included from /builddir/build/BUILD/openvdb-5.1.0/openvdb/math/BBox.h:35,
BUILDSTDERR:                  from /builddir/build/BUILD/openvdb-5.1.0/openvdb/Types.h:38,
BUILDSTDERR:                  from /builddir/build/BUILD/openvdb-5.1.0/openvdb/Metadata.h:36,
BUILDSTDERR:                  from /builddir/build/BUILD/openvdb-5.1.0/openvdb/MetaMap.h:34,
BUILDSTDERR:                  from /builddir/build/BUILD/openvdb-5.1.0/openvdb/Grid.h:35,
BUILDSTDERR:                  from /builddir/build/BUILD/openvdb-5.1.0/openvdb/points/PointDataGrid.h:43,
BUILDSTDERR:                  from /builddir/build/BUILD/openvdb-5.1.0/openvdb/points/points.cc:33:
BUILDSTDERR: /builddir/build/BUILD/openvdb-5.1.0/openvdb/math/Vec3.h:50:7: note: 'class openvdb::v5_1abi3::math::Vec3<unsigned char>' declared here
BUILDSTDERR:  class Vec3: public Tuple<3, T>
BUILDSTDERR:        ^~~~
BUILDSTDERR: In file included from /builddir/build/BUILD/openvdb-5.1.0/openvdb/points/PointDataGrid.h:47,
BUILDSTDERR:                  from /builddir/build/BUILD/openvdb-5.1.0/openvdb/points/points.cc:33:
BUILDSTDERR: /builddir/build/BUILD/openvdb-5.1.0/openvdb/points/AttributeArray.h: In instantiation of 'openvdb::v5_1abi3::points::TypedAttributeArray<ValueType_, Codec_>::TypedAttributeArray(const openvdb::v5_1abi3::points::TypedAttributeArray<ValueType_, Codec_>&, bool) [with ValueType_ = openvdb::v5_1abi3::math::Vec3<float>; Codec_ = openvdb::v5_1abi3::points::FixedPointCodec<false>]':
BUILDSTDERR: /builddir/build/BUILD/openvdb-5.1.0/openvdb/points/AttributeArray.h:1010:32:   required from 'openvdb::v5_1abi3::points::AttributeArray::Ptr openvdb::v5_1abi3::points::TypedAttributeArray<ValueType_, Codec_>::copy() const [with ValueType_ = openvdb::v5_1abi3::math::Vec3<float>; Codec_ = openvdb::v5_1abi3::points::FixedPointCodec<false>; openvdb::v5_1abi3::points::AttributeArray::Ptr = std::shared_ptr<openvdb::v5_1abi3::points::AttributeArray>]'
BUILDSTDERR: /builddir/build/BUILD/openvdb-5.1.0/openvdb/points/AttributeArray.h:1008:1:   required from here
BUILDSTDERR: /builddir/build/BUILD/openvdb-5.1.0/openvdb/points/AttributeArray.h:905:20: warning: 'void* memcpy(void*, const void*, size_t)' writing to an object of type 'class openvdb::v5_1abi3::math::Vec3<short unsigned int>' with no trivial copy-assignment; use copy-assignment or copy-initialization instead [-Wclass-memaccess]
BUILDSTDERR:          std::memcpy(mData.get(), rhs.mData.get(), this->arrayMemUsage());
BUILDSTDERR:          ~~~~~~~~~~~^~~~~~~~~~~~~~~~~~~~~~~~~~~~~~~~~~~~~~~~~~~~~~~~~~~~~
BUILDSTDERR: In file included from /builddir/build/BUILD/openvdb-5.1.0/openvdb/math/BBox.h:35,
BUILDSTDERR:                  from /builddir/build/BUILD/openvdb-5.1.0/openvdb/Types.h:38,
BUILDSTDERR:                  from /builddir/build/BUILD/openvdb-5.1.0/openvdb/Metadata.h:36,
BUILDSTDERR:                  from /builddir/build/BUILD/openvdb-5.1.0/openvdb/MetaMap.h:34,
BUILDSTDERR:                  from /builddir/build/BUILD/openvdb-5.1.0/openvdb/Grid.h:35,
BUILDSTDERR:                  from /builddir/build/BUILD/openvdb-5.1.0/openvdb/points/PointDataGrid.h:43,
BUILDSTDERR:                  from /builddir/build/BUILD/openvdb-5.1.0/openvdb/points/points.cc:33:
BUILDSTDERR: /builddir/build/BUILD/openvdb-5.1.0/openvdb/math/Vec3.h:50:7: note: 'class openvdb::v5_1abi3::math::Vec3<short unsigned int>' declared here
BUILDSTDERR:  class Vec3: public Tuple<3, T>
BUILDSTDERR:        ^~~~
BUILDSTDERR: In file included from /builddir/build/BUILD/openvdb-5.1.0/openvdb/points/PointDataGrid.h:47,
BUILDSTDERR:                  from /builddir/build/BUILD/openvdb-5.1.0/openvdb/points/points.cc:33:
BUILDSTDERR: /builddir/build/BUILD/openvdb-5.1.0/openvdb/points/AttributeArray.h: In instantiation of 'openvdb::v5_1abi3::points::TypedAttributeArray<ValueType_, Codec_>::TypedAttributeArray(const openvdb::v5_1abi3::points::TypedAttributeArray<ValueType_, Codec_>&, bool) [with ValueType_ = openvdb::v5_1abi3::math::Vec3<float>; Codec_ = openvdb::v5_1abi3::points::FixedPointCodec<true>]':
BUILDSTDERR: /builddir/build/BUILD/openvdb-5.1.0/openvdb/points/AttributeArray.h:1010:32:   required from 'openvdb::v5_1abi3::points::AttributeArray::Ptr openvdb::v5_1abi3::points::TypedAttributeArray<ValueType_, Codec_>::copy() const [with ValueType_ = openvdb::v5_1abi3::math::Vec3<float>; Codec_ = openvdb::v5_1abi3::points::FixedPointCodec<true>; openvdb::v5_1abi3::points::AttributeArray::Ptr = std::shared_ptr<openvdb::v5_1abi3::points::AttributeArray>]'
BUILDSTDERR: /builddir/build/BUILD/openvdb-5.1.0/openvdb/points/AttributeArray.h:1008:1:   required from here
BUILDSTDERR: /builddir/build/BUILD/openvdb-5.1.0/openvdb/points/AttributeArray.h:905:20: warning: 'void* memcpy(void*, const void*, size_t)' writing to an object of type 'class openvdb::v5_1abi3::math::Vec3<unsigned char>' with no trivial copy-assignment; use copy-assignment or copy-initialization instead [-Wclass-memaccess]
BUILDSTDERR:          std::memcpy(mData.get(), rhs.mData.get(), this->arrayMemUsage());
BUILDSTDERR:          ~~~~~~~~~~~^~~~~~~~~~~~~~~~~~~~~~~~~~~~~~~~~~~~~~~~~~~~~~~~~~~~~
BUILDSTDERR: In file included from /builddir/build/BUILD/openvdb-5.1.0/openvdb/math/BBox.h:35,
BUILDSTDERR:                  from /builddir/build/BUILD/openvdb-5.1.0/openvdb/Types.h:38,
BUILDSTDERR:                  from /builddir/build/BUILD/openvdb-5.1.0/openvdb/Metadata.h:36,
BUILDSTDERR:                  from /builddir/build/BUILD/openvdb-5.1.0/openvdb/MetaMap.h:34,
BUILDSTDERR:                  from /builddir/build/BUILD/openvdb-5.1.0/openvdb/Grid.h:35,
BUILDSTDERR:                  from /builddir/build/BUILD/openvdb-5.1.0/openvdb/points/PointDataGrid.h:43,
BUILDSTDERR:                  from /builddir/build/BUILD/openvdb-5.1.0/openvdb/points/points.cc:33:
BUILDSTDERR: /builddir/build/BUILD/openvdb-5.1.0/openvdb/math/Vec3.h:50:7: note: 'class openvdb::v5_1abi3::math::Vec3<unsigned char>' declared here
BUILDSTDERR:  class Vec3: public Tuple<3, T>
BUILDSTDERR:        ^~~~
BUILDSTDERR: In file included from /builddir/build/BUILD/openvdb-5.1.0/openvdb/points/PointDataGrid.h:47,
BUILDSTDERR:                  from /builddir/build/BUILD/openvdb-5.1.0/openvdb/points/points.cc:33:
BUILDSTDERR: /builddir/build/BUILD/openvdb-5.1.0/openvdb/points/AttributeArray.h: In instantiation of 'openvdb::v5_1abi3::points::TypedAttributeArray<ValueType_, Codec_>::TypedAttributeArray(const openvdb::v5_1abi3::points::TypedAttributeArray<ValueType_, Codec_>&, bool) [with ValueType_ = openvdb::v5_1abi3::math::Vec3<float>; Codec_ = openvdb::v5_1abi3::points::TruncateCodec]':
BUILDSTDERR: /builddir/build/BUILD/openvdb-5.1.0/openvdb/points/AttributeArray.h:1010:32:   required from 'openvdb::v5_1abi3::points::AttributeArray::Ptr openvdb::v5_1abi3::points::TypedAttributeArray<ValueType_, Codec_>::copy() const [with ValueType_ = openvdb::v5_1abi3::math::Vec3<float>; Codec_ = openvdb::v5_1abi3::points::TruncateCodec; openvdb::v5_1abi3::points::AttributeArray::Ptr = std::shared_ptr<openvdb::v5_1abi3::points::AttributeArray>]'
BUILDSTDERR: /builddir/build/BUILD/openvdb-5.1.0/openvdb/points/AttributeArray.h:1008:1:   required from here
BUILDSTDERR: /builddir/build/BUILD/openvdb-5.1.0/openvdb/points/AttributeArray.h:905:20: warning: 'void* memcpy(void*, const void*, size_t)' writing to an object of type 'class openvdb::v5_1abi3::math::Vec3<half>' with no trivial copy-assignment; use copy-assignment or copy-initialization instead [-Wclass-memaccess]
BUILDSTDERR:          std::memcpy(mData.get(), rhs.mData.get(), this->arrayMemUsage());
BUILDSTDERR:          ~~~~~~~~~~~^~~~~~~~~~~~~~~~~~~~~~~~~~~~~~~~~~~~~~~~~~~~~~~~~~~~~
BUILDSTDERR: In file included from /builddir/build/BUILD/openvdb-5.1.0/openvdb/math/BBox.h:35,
BUILDSTDERR:                  from /builddir/build/BUILD/openvdb-5.1.0/openvdb/Types.h:38,
BUILDSTDERR:                  from /builddir/build/BUILD/openvdb-5.1.0/openvdb/Metadata.h:36,
BUILDSTDERR:                  from /builddir/build/BUILD/openvdb-5.1.0/openvdb/MetaMap.h:34,
BUILDSTDERR:                  from /builddir/build/BUILD/openvdb-5.1.0/openvdb/Grid.h:35,
BUILDSTDERR:                  from /builddir/build/BUILD/openvdb-5.1.0/openvdb/points/PointDataGrid.h:43,
BUILDSTDERR:                  from /builddir/build/BUILD/openvdb-5.1.0/openvdb/points/points.cc:33:
BUILDSTDERR: /builddir/build/BUILD/openvdb-5.1.0/openvdb/math/Vec3.h:50:7: note: 'class openvdb::v5_1abi3::math::Vec3<half>' declared here
BUILDSTDERR:  class Vec3: public Tuple<3, T>
BUILDSTDERR:        ^~~~
BUILDSTDERR: In file included from /builddir/build/BUILD/openvdb-5.1.0/openvdb/points/PointDataGrid.h:47,
BUILDSTDERR:                  from /builddir/build/BUILD/openvdb-5.1.0/openvdb/points/points.cc:33:
BUILDSTDERR: /builddir/build/BUILD/openvdb-5.1.0/openvdb/points/AttributeArray.h: In instantiation of 'openvdb::v5_1abi3::points::TypedAttributeArray<ValueType_, Codec_>::TypedAttributeArray(const openvdb::v5_1abi3::points::TypedAttributeArray<ValueType_, Codec_>&, bool) [with ValueType_ = float; Codec_ = openvdb::v5_1abi3::points::TruncateCodec]':
BUILDSTDERR: /builddir/build/BUILD/openvdb-5.1.0/openvdb/points/AttributeArray.h:1010:32:   required from 'openvdb::v5_1abi3::points::AttributeArray::Ptr openvdb::v5_1abi3::points::TypedAttributeArray<ValueType_, Codec_>::copy() const [with ValueType_ = float; Codec_ = openvdb::v5_1abi3::points::TruncateCodec; openvdb::v5_1abi3::points::AttributeArray::Ptr = std::shared_ptr<openvdb::v5_1abi3::points::AttributeArray>]'
BUILDSTDERR: /builddir/build/BUILD/openvdb-5.1.0/openvdb/points/AttributeArray.h:1008:1:   required from here
BUILDSTDERR: /builddir/build/BUILD/openvdb-5.1.0/openvdb/points/AttributeArray.h:905:20: warning: 'void* memcpy(void*, const void*, size_t)' writing to an object of type 'class half' with no trivial copy-assignment; use copy-assignment or copy-initialization instead [-Wclass-memaccess]
BUILDSTDERR:          std::memcpy(mData.get(), rhs.mData.get(), this->arrayMemUsage());
BUILDSTDERR:          ~~~~~~~~~~~^~~~~~~~~~~~~~~~~~~~~~~~~~~~~~~~~~~~~~~~~~~~~~~~~~~~~
BUILDSTDERR: In file included from /builddir/build/BUILD/openvdb-5.1.0/openvdb/Types.h:36,
BUILDSTDERR:                  from /builddir/build/BUILD/openvdb-5.1.0/openvdb/Metadata.h:36,
BUILDSTDERR:                  from /builddir/build/BUILD/openvdb-5.1.0/openvdb/MetaMap.h:34,
BUILDSTDERR:                  from /builddir/build/BUILD/openvdb-5.1.0/openvdb/Grid.h:35,
BUILDSTDERR:                  from /builddir/build/BUILD/openvdb-5.1.0/openvdb/points/PointDataGrid.h:43,
BUILDSTDERR:                  from /builddir/build/BUILD/openvdb-5.1.0/openvdb/points/points.cc:33:
BUILDSTDERR: /usr/include/OpenEXR/half.h:91:7: note: 'class half' declared here
BUILDSTDERR:  class half
BUILDSTDERR:        ^~~~
BUILDSTDERR: In file included from /builddir/build/BUILD/openvdb-5.1.0/openvdb/points/PointDataGrid.h:47,
BUILDSTDERR:                  from /builddir/build/BUILD/openvdb-5.1.0/openvdb/points/points.cc:33:
BUILDSTDERR: /builddir/build/BUILD/openvdb-5.1.0/openvdb/points/AttributeArray.h: In instantiation of 'openvdb::v5_1abi3::points::TypedAttributeArray<ValueType_, Codec_>::TypedAttributeArray(const openvdb::v5_1abi3::points::TypedAttributeArray<ValueType_, Codec_>&, bool) [with ValueType_ = openvdb::v5_1abi3::math::Quat<double>; Codec_ = openvdb::v5_1abi3::points::NullCodec]':
BUILDSTDERR: /builddir/build/BUILD/openvdb-5.1.0/openvdb/points/AttributeArray.h:1010:32:   required from 'openvdb::v5_1abi3::points::AttributeArray::Ptr openvdb::v5_1abi3::points::TypedAttributeArray<ValueType_, Codec_>::copy() const [with ValueType_ = openvdb::v5_1abi3::math::Quat<double>; Codec_ = openvdb::v5_1abi3::points::NullCodec; openvdb::v5_1abi3::points::AttributeArray::Ptr = std::shared_ptr<openvdb::v5_1abi3::points::AttributeArray>]'
BUILDSTDERR: /builddir/build/BUILD/openvdb-5.1.0/openvdb/points/AttributeArray.h:1008:1:   required from here
BUILDSTDERR: /builddir/build/BUILD/openvdb-5.1.0/openvdb/points/AttributeArray.h:905:20: warning: 'void* memcpy(void*, const void*, size_t)' writing to an object of type 'class openvdb::v5_1abi3::math::Quat<double>' with no trivial copy-assignment; use copy-assignment or copy-initialization instead [-Wclass-memaccess]
BUILDSTDERR:          std::memcpy(mData.get(), rhs.mData.get(), this->arrayMemUsage());
BUILDSTDERR:          ~~~~~~~~~~~^~~~~~~~~~~~~~~~~~~~~~~~~~~~~~~~~~~~~~~~~~~~~~~~~~~~~
BUILDSTDERR: In file included from /builddir/build/BUILD/openvdb-5.1.0/openvdb/Types.h:39,
BUILDSTDERR:                  from /builddir/build/BUILD/openvdb-5.1.0/openvdb/Metadata.h:36,
BUILDSTDERR:                  from /builddir/build/BUILD/openvdb-5.1.0/openvdb/MetaMap.h:34,
BUILDSTDERR:                  from /builddir/build/BUILD/openvdb-5.1.0/openvdb/Grid.h:35,
BUILDSTDERR:                  from /builddir/build/BUILD/openvdb-5.1.0/openvdb/points/PointDataGrid.h:43,
BUILDSTDERR:                  from /builddir/build/BUILD/openvdb-5.1.0/openvdb/points/points.cc:33:
BUILDSTDERR: /builddir/build/BUILD/openvdb-5.1.0/openvdb/math/Quat.h:105:7: note: 'class openvdb::v5_1abi3::math::Quat<double>' declared here
BUILDSTDERR:  class Quat
BUILDSTDERR:        ^~~~
BUILDSTDERR: In file included from /builddir/build/BUILD/openvdb-5.1.0/openvdb/points/PointDataGrid.h:47,
BUILDSTDERR:                  from /builddir/build/BUILD/openvdb-5.1.0/openvdb/points/points.cc:33:
BUILDSTDERR: /builddir/build/BUILD/openvdb-5.1.0/openvdb/points/AttributeArray.h: In instantiation of 'openvdb::v5_1abi3::points::TypedAttributeArray<ValueType_, Codec_>::TypedAttributeArray(const openvdb::v5_1abi3::points::TypedAttributeArray<ValueType_, Codec_>&, bool) [with ValueType_ = openvdb::v5_1abi3::math::Quat<float>; Codec_ = openvdb::v5_1abi3::points::NullCodec]':
BUILDSTDERR: /builddir/build/BUILD/openvdb-5.1.0/openvdb/points/AttributeArray.h:1010:32:   required from 'openvdb::v5_1abi3::points::AttributeArray::Ptr openvdb::v5_1abi3::points::TypedAttributeArray<ValueType_, Codec_>::copy() const [with ValueType_ = openvdb::v5_1abi3::math::Quat<float>; Codec_ = openvdb::v5_1abi3::points::NullCodec; openvdb::v5_1abi3::points::AttributeArray::Ptr = std::shared_ptr<openvdb::v5_1abi3::points::AttributeArray>]'
BUILDSTDERR: /builddir/build/BUILD/openvdb-5.1.0/openvdb/points/AttributeArray.h:1008:1:   required from here
BUILDSTDERR: /builddir/build/BUILD/openvdb-5.1.0/openvdb/points/AttributeArray.h:905:20: warning: 'void* memcpy(void*, const void*, size_t)' writing to an object of type 'class openvdb::v5_1abi3::math::Quat<float>' with no trivial copy-assignment; use copy-assignment or copy-initialization instead [-Wclass-memaccess]
BUILDSTDERR:          std::memcpy(mData.get(), rhs.mData.get(), this->arrayMemUsage());
BUILDSTDERR:          ~~~~~~~~~~~^~~~~~~~~~~~~~~~~~~~~~~~~~~~~~~~~~~~~~~~~~~~~~~~~~~~~
BUILDSTDERR: In file included from /builddir/build/BUILD/openvdb-5.1.0/openvdb/Types.h:39,
BUILDSTDERR:                  from /builddir/build/BUILD/openvdb-5.1.0/openvdb/Metadata.h:36,
BUILDSTDERR:                  from /builddir/build/BUILD/openvdb-5.1.0/openvdb/MetaMap.h:34,
BUILDSTDERR:                  from /builddir/build/BUILD/openvdb-5.1.0/openvdb/Grid.h:35,
BUILDSTDERR:                  from /builddir/build/BUILD/openvdb-5.1.0/openvdb/points/PointDataGrid.h:43,
BUILDSTDERR:                  from /builddir/build/BUILD/openvdb-5.1.0/openvdb/points/points.cc:33:
BUILDSTDERR: /builddir/build/BUILD/openvdb-5.1.0/openvdb/math/Quat.h:105:7: note: 'class openvdb::v5_1abi3::math::Quat<float>' declared here
BUILDSTDERR:  class Quat
BUILDSTDERR:        ^~~~
BUILDSTDERR: In file included from /builddir/build/BUILD/openvdb-5.1.0/openvdb/points/PointDataGrid.h:47,
BUILDSTDERR:                  from /builddir/build/BUILD/openvdb-5.1.0/openvdb/points/points.cc:33:
BUILDSTDERR: /builddir/build/BUILD/openvdb-5.1.0/openvdb/points/AttributeArray.h: In instantiation of 'openvdb::v5_1abi3::points::TypedAttributeArray<ValueType_, Codec_>::TypedAttributeArray(const openvdb::v5_1abi3::points::TypedAttributeArray<ValueType_, Codec_>&, bool) [with ValueType_ = openvdb::v5_1abi3::math::Mat4<double>; Codec_ = openvdb::v5_1abi3::points::NullCodec]':
BUILDSTDERR: /builddir/build/BUILD/openvdb-5.1.0/openvdb/points/AttributeArray.h:1010:32:   required from 'openvdb::v5_1abi3::points::AttributeArray::Ptr openvdb::v5_1abi3::points::TypedAttributeArray<ValueType_, Codec_>::copy() const [with ValueType_ = openvdb::v5_1abi3::math::Mat4<double>; Codec_ = openvdb::v5_1abi3::points::NullCodec; openvdb::v5_1abi3::points::AttributeArray::Ptr = std::shared_ptr<openvdb::v5_1abi3::points::AttributeArray>]'
BUILDSTDERR: /builddir/build/BUILD/openvdb-5.1.0/openvdb/points/AttributeArray.h:1008:1:   required from here
BUILDSTDERR: /builddir/build/BUILD/openvdb-5.1.0/openvdb/points/AttributeArray.h:905:20: warning: 'void* memcpy(void*, const void*, size_t)' writing to an object of type 'class openvdb::v5_1abi3::math::Mat4<double>' with no trivial copy-assignment; use copy-assignment or copy-initialization instead [-Wclass-memaccess]
BUILDSTDERR:          std::memcpy(mData.get(), rhs.mData.get(), this->arrayMemUsage());
BUILDSTDERR:          ~~~~~~~~~~~^~~~~~~~~~~~~~~~~~~~~~~~~~~~~~~~~~~~~~~~~~~~~~~~~~~~~
BUILDSTDERR: In file included from /builddir/build/BUILD/openvdb-5.1.0/openvdb/Types.h:44,
BUILDSTDERR:                  from /builddir/build/BUILD/openvdb-5.1.0/openvdb/Metadata.h:36,
BUILDSTDERR:                  from /builddir/build/BUILD/openvdb-5.1.0/openvdb/MetaMap.h:34,
BUILDSTDERR:                  from /builddir/build/BUILD/openvdb-5.1.0/openvdb/Grid.h:35,
BUILDSTDERR:                  from /builddir/build/BUILD/openvdb-5.1.0/openvdb/points/PointDataGrid.h:43,
BUILDSTDERR:                  from /builddir/build/BUILD/openvdb-5.1.0/openvdb/points/points.cc:33:
BUILDSTDERR: /builddir/build/BUILD/openvdb-5.1.0/openvdb/math/Mat4.h:57:7: note: 'class openvdb::v5_1abi3::math::Mat4<double>' declared here
BUILDSTDERR:  class Mat4: public Mat<4, T>
BUILDSTDERR:        ^~~~
BUILDSTDERR: In file included from /builddir/build/BUILD/openvdb-5.1.0/openvdb/points/PointDataGrid.h:47,
BUILDSTDERR:                  from /builddir/build/BUILD/openvdb-5.1.0/openvdb/points/points.cc:33:
BUILDSTDERR: /builddir/build/BUILD/openvdb-5.1.0/openvdb/points/AttributeArray.h: In instantiation of 'openvdb::v5_1abi3::points::TypedAttributeArray<ValueType_, Codec_>::TypedAttributeArray(const openvdb::v5_1abi3::points::TypedAttributeArray<ValueType_, Codec_>&, bool) [with ValueType_ = openvdb::v5_1abi3::math::Mat4<float>; Codec_ = openvdb::v5_1abi3::points::NullCodec]':
BUILDSTDERR: /builddir/build/BUILD/openvdb-5.1.0/openvdb/points/AttributeArray.h:1010:32:   required from 'openvdb::v5_1abi3::points::AttributeArray::Ptr openvdb::v5_1abi3::points::TypedAttributeArray<ValueType_, Codec_>::copy() const [with ValueType_ = openvdb::v5_1abi3::math::Mat4<float>; Codec_ = openvdb::v5_1abi3::points::NullCodec; openvdb::v5_1abi3::points::AttributeArray::Ptr = std::shared_ptr<openvdb::v5_1abi3::points::AttributeArray>]'
BUILDSTDERR: /builddir/build/BUILD/openvdb-5.1.0/openvdb/points/AttributeArray.h:1008:1:   required from here
BUILDSTDERR: /builddir/build/BUILD/openvdb-5.1.0/openvdb/points/AttributeArray.h:905:20: warning: 'void* memcpy(void*, const void*, size_t)' writing to an object of type 'class openvdb::v5_1abi3::math::Mat4<float>' with no trivial copy-assignment; use copy-assignment or copy-initialization instead [-Wclass-memaccess]
BUILDSTDERR:          std::memcpy(mData.get(), rhs.mData.get(), this->arrayMemUsage());
BUILDSTDERR:          ~~~~~~~~~~~^~~~~~~~~~~~~~~~~~~~~~~~~~~~~~~~~~~~~~~~~~~~~~~~~~~~~
BUILDSTDERR: In file included from /builddir/build/BUILD/openvdb-5.1.0/openvdb/Types.h:44,
BUILDSTDERR:                  from /builddir/build/BUILD/openvdb-5.1.0/openvdb/Metadata.h:36,
BUILDSTDERR:                  from /builddir/build/BUILD/openvdb-5.1.0/openvdb/MetaMap.h:34,
BUILDSTDERR:                  from /builddir/build/BUILD/openvdb-5.1.0/openvdb/Grid.h:35,
BUILDSTDERR:                  from /builddir/build/BUILD/openvdb-5.1.0/openvdb/points/PointDataGrid.h:43,
BUILDSTDERR:                  from /builddir/build/BUILD/openvdb-5.1.0/openvdb/points/points.cc:33:
BUILDSTDERR: /builddir/build/BUILD/openvdb-5.1.0/openvdb/math/Mat4.h:57:7: note: 'class openvdb::v5_1abi3::math::Mat4<float>' declared here
BUILDSTDERR:  class Mat4: public Mat<4, T>
BUILDSTDERR:        ^~~~
BUILDSTDERR: In file included from /builddir/build/BUILD/openvdb-5.1.0/openvdb/points/PointDataGrid.h:47,
BUILDSTDERR:                  from /builddir/build/BUILD/openvdb-5.1.0/openvdb/points/points.cc:33:
BUILDSTDERR: /builddir/build/BUILD/openvdb-5.1.0/openvdb/points/AttributeArray.h: In instantiation of 'openvdb::v5_1abi3::points::TypedAttributeArray<ValueType_, Codec_>::TypedAttributeArray(const openvdb::v5_1abi3::points::TypedAttributeArray<ValueType_, Codec_>&, bool) [with ValueType_ = openvdb::v5_1abi3::math::Mat3<double>; Codec_ = openvdb::v5_1abi3::points::NullCodec]':
BUILDSTDERR: /builddir/build/BUILD/openvdb-5.1.0/openvdb/points/AttributeArray.h:1010:32:   required from 'openvdb::v5_1abi3::points::AttributeArray::Ptr openvdb::v5_1abi3::points::TypedAttributeArray<ValueType_, Codec_>::copy() const [with ValueType_ = openvdb::v5_1abi3::math::Mat3<double>; Codec_ = openvdb::v5_1abi3::points::NullCodec; openvdb::v5_1abi3::points::AttributeArray::Ptr = std::shared_ptr<openvdb::v5_1abi3::points::AttributeArray>]'
BUILDSTDERR: /builddir/build/BUILD/openvdb-5.1.0/openvdb/points/AttributeArray.h:1008:1:   required from here
BUILDSTDERR: /builddir/build/BUILD/openvdb-5.1.0/openvdb/points/AttributeArray.h:905:20: warning: 'void* memcpy(void*, const void*, size_t)' writing to an object of type 'class openvdb::v5_1abi3::math::Mat3<double>' with no trivial copy-assignment; use copy-assignment or copy-initialization instead [-Wclass-memaccess]
BUILDSTDERR:          std::memcpy(mData.get(), rhs.mData.get(), this->arrayMemUsage());
BUILDSTDERR:          ~~~~~~~~~~~^~~~~~~~~~~~~~~~~~~~~~~~~~~~~~~~~~~~~~~~~~~~~~~~~~~~~
BUILDSTDERR: In file included from /builddir/build/BUILD/openvdb-5.1.0/openvdb/math/Quat.h:35,
BUILDSTDERR:                  from /builddir/build/BUILD/openvdb-5.1.0/openvdb/Types.h:39,
BUILDSTDERR:                  from /builddir/build/BUILD/openvdb-5.1.0/openvdb/Metadata.h:36,
BUILDSTDERR:                  from /builddir/build/BUILD/openvdb-5.1.0/openvdb/MetaMap.h:34,
BUILDSTDERR:                  from /builddir/build/BUILD/openvdb-5.1.0/openvdb/Grid.h:35,
BUILDSTDERR:                  from /builddir/build/BUILD/openvdb-5.1.0/openvdb/points/PointDataGrid.h:43,
BUILDSTDERR:                  from /builddir/build/BUILD/openvdb-5.1.0/openvdb/points/points.cc:33:
BUILDSTDERR: /builddir/build/BUILD/openvdb-5.1.0/openvdb/math/Mat3.h:55:7: note: 'class openvdb::v5_1abi3::math::Mat3<double>' declared here
BUILDSTDERR:  class Mat3: public Mat<3, T>
BUILDSTDERR:        ^~~~
BUILDSTDERR: In file included from /builddir/build/BUILD/openvdb-5.1.0/openvdb/points/PointDataGrid.h:47,
BUILDSTDERR:                  from /builddir/build/BUILD/openvdb-5.1.0/openvdb/points/points.cc:33:
BUILDSTDERR: /builddir/build/BUILD/openvdb-5.1.0/openvdb/points/AttributeArray.h: In instantiation of 'openvdb::v5_1abi3::points::TypedAttributeArray<ValueType_, Codec_>::TypedAttributeArray(const openvdb::v5_1abi3::points::TypedAttributeArray<ValueType_, Codec_>&, bool) [with ValueType_ = openvdb::v5_1abi3::math::Mat3<float>; Codec_ = openvdb::v5_1abi3::points::NullCodec]':
BUILDSTDERR: /builddir/build/BUILD/openvdb-5.1.0/openvdb/points/AttributeArray.h:1010:32:   required from 'openvdb::v5_1abi3::points::AttributeArray::Ptr openvdb::v5_1abi3::points::TypedAttributeArray<ValueType_, Codec_>::copy() const [with ValueType_ = openvdb::v5_1abi3::math::Mat3<float>; Codec_ = openvdb::v5_1abi3::points::NullCodec; openvdb::v5_1abi3::points::AttributeArray::Ptr = std::shared_ptr<openvdb::v5_1abi3::points::AttributeArray>]'
BUILDSTDERR: /builddir/build/BUILD/openvdb-5.1.0/openvdb/points/AttributeArray.h:1008:1:   required from here
BUILDSTDERR: /builddir/build/BUILD/openvdb-5.1.0/openvdb/points/AttributeArray.h:905:20: warning: 'void* memcpy(void*, const void*, size_t)' writing to an object of type 'class openvdb::v5_1abi3::math::Mat3<float>' with no trivial copy-assignment; use copy-assignment or copy-initialization instead [-Wclass-memaccess]
BUILDSTDERR:          std::memcpy(mData.get(), rhs.mData.get(), this->arrayMemUsage());
BUILDSTDERR:          ~~~~~~~~~~~^~~~~~~~~~~~~~~~~~~~~~~~~~~~~~~~~~~~~~~~~~~~~~~~~~~~~
BUILDSTDERR: In file included from /builddir/build/BUILD/openvdb-5.1.0/openvdb/math/Quat.h:35,
BUILDSTDERR:                  from /builddir/build/BUILD/openvdb-5.1.0/openvdb/Types.h:39,
BUILDSTDERR:                  from /builddir/build/BUILD/openvdb-5.1.0/openvdb/Metadata.h:36,
BUILDSTDERR:                  from /builddir/build/BUILD/openvdb-5.1.0/openvdb/MetaMap.h:34,
BUILDSTDERR:                  from /builddir/build/BUILD/openvdb-5.1.0/openvdb/Grid.h:35,
BUILDSTDERR:                  from /builddir/build/BUILD/openvdb-5.1.0/openvdb/points/PointDataGrid.h:43,
BUILDSTDERR:                  from /builddir/build/BUILD/openvdb-5.1.0/openvdb/points/points.cc:33:
BUILDSTDERR: /builddir/build/BUILD/openvdb-5.1.0/openvdb/math/Mat3.h:55:7: note: 'class openvdb::v5_1abi3::math::Mat3<float>' declared here
BUILDSTDERR:  class Mat3: public Mat<3, T>
BUILDSTDERR:        ^~~~
BUILDSTDERR: In file included from /builddir/build/BUILD/openvdb-5.1.0/openvdb/points/PointDataGrid.h:47,
BUILDSTDERR:                  from /builddir/build/BUILD/openvdb-5.1.0/openvdb/points/points.cc:33:
BUILDSTDERR: /builddir/build/BUILD/openvdb-5.1.0/openvdb/points/AttributeArray.h: In instantiation of 'openvdb::v5_1abi3::points::TypedAttributeArray<ValueType_, Codec_>::TypedAttributeArray(const openvdb::v5_1abi3::points::TypedAttributeArray<ValueType_, Codec_>&, bool) [with ValueType_ = openvdb::v5_1abi3::math::Vec3<double>; Codec_ = openvdb::v5_1abi3::points::NullCodec]':
BUILDSTDERR: /builddir/build/BUILD/openvdb-5.1.0/openvdb/points/AttributeArray.h:1010:32:   required from 'openvdb::v5_1abi3::points::AttributeArray::Ptr openvdb::v5_1abi3::points::TypedAttributeArray<ValueType_, Codec_>::copy() const [with ValueType_ = openvdb::v5_1abi3::math::Vec3<double>; Codec_ = openvdb::v5_1abi3::points::NullCodec; openvdb::v5_1abi3::points::AttributeArray::Ptr = std::shared_ptr<openvdb::v5_1abi3::points::AttributeArray>]'
BUILDSTDERR: /builddir/build/BUILD/openvdb-5.1.0/openvdb/points/AttributeArray.h:1008:1:   required from here
BUILDSTDERR: /builddir/build/BUILD/openvdb-5.1.0/openvdb/points/AttributeArray.h:905:20: warning: 'void* memcpy(void*, const void*, size_t)' writing to an object of type 'class openvdb::v5_1abi3::math::Vec3<double>' with no trivial copy-assignment; use copy-assignment or copy-initialization instead [-Wclass-memaccess]
BUILDSTDERR:          std::memcpy(mData.get(), rhs.mData.get(), this->arrayMemUsage());
BUILDSTDERR:          ~~~~~~~~~~~^~~~~~~~~~~~~~~~~~~~~~~~~~~~~~~~~~~~~~~~~~~~~~~~~~~~~
BUILDSTDERR: In file included from /builddir/build/BUILD/openvdb-5.1.0/openvdb/math/BBox.h:35,
BUILDSTDERR:                  from /builddir/build/BUILD/openvdb-5.1.0/openvdb/Types.h:38,
BUILDSTDERR:                  from /builddir/build/BUILD/openvdb-5.1.0/openvdb/Metadata.h:36,
BUILDSTDERR:                  from /builddir/build/BUILD/openvdb-5.1.0/openvdb/MetaMap.h:34,
BUILDSTDERR:                  from /builddir/build/BUILD/openvdb-5.1.0/openvdb/Grid.h:35,
BUILDSTDERR:                  from /builddir/build/BUILD/openvdb-5.1.0/openvdb/points/PointDataGrid.h:43,
BUILDSTDERR:                  from /builddir/build/BUILD/openvdb-5.1.0/openvdb/points/points.cc:33:
BUILDSTDERR: /builddir/build/BUILD/openvdb-5.1.0/openvdb/math/Vec3.h:50:7: note: 'class openvdb::v5_1abi3::math::Vec3<double>' declared here
BUILDSTDERR:  class Vec3: public Tuple<3, T>
BUILDSTDERR:        ^~~~
BUILDSTDERR: In file included from /builddir/build/BUILD/openvdb-5.1.0/openvdb/points/PointDataGrid.h:47,
BUILDSTDERR:                  from /builddir/build/BUILD/openvdb-5.1.0/openvdb/points/points.cc:33:
BUILDSTDERR: /builddir/build/BUILD/openvdb-5.1.0/openvdb/points/AttributeArray.h: In instantiation of 'openvdb::v5_1abi3::points::TypedAttributeArray<ValueType_, Codec_>::TypedAttributeArray(const openvdb::v5_1abi3::points::TypedAttributeArray<ValueType_, Codec_>&, bool) [with ValueType_ = openvdb::v5_1abi3::math::Vec3<float>; Codec_ = openvdb::v5_1abi3::points::NullCodec]':
BUILDSTDERR: /builddir/build/BUILD/openvdb-5.1.0/openvdb/points/AttributeArray.h:1010:32:   required from 'openvdb::v5_1abi3::points::AttributeArray::Ptr openvdb::v5_1abi3::points::TypedAttributeArray<ValueType_, Codec_>::copy() const [with ValueType_ = openvdb::v5_1abi3::math::Vec3<float>; Codec_ = openvdb::v5_1abi3::points::NullCodec; openvdb::v5_1abi3::points::AttributeArray::Ptr = std::shared_ptr<openvdb::v5_1abi3::points::AttributeArray>]'
BUILDSTDERR: /builddir/build/BUILD/openvdb-5.1.0/openvdb/points/AttributeArray.h:1008:1:   required from here
BUILDSTDERR: /builddir/build/BUILD/openvdb-5.1.0/openvdb/points/AttributeArray.h:905:20: warning: 'void* memcpy(void*, const void*, size_t)' writing to an object of type 'class openvdb::v5_1abi3::math::Vec3<float>' with no trivial copy-assignment; use copy-assignment or copy-initialization instead [-Wclass-memaccess]
BUILDSTDERR:          std::memcpy(mData.get(), rhs.mData.get(), this->arrayMemUsage());
BUILDSTDERR:          ~~~~~~~~~~~^~~~~~~~~~~~~~~~~~~~~~~~~~~~~~~~~~~~~~~~~~~~~~~~~~~~~
BUILDSTDERR: In file included from /builddir/build/BUILD/openvdb-5.1.0/openvdb/math/BBox.h:35,
BUILDSTDERR:                  from /builddir/build/BUILD/openvdb-5.1.0/openvdb/Types.h:38,
BUILDSTDERR:                  from /builddir/build/BUILD/openvdb-5.1.0/openvdb/Metadata.h:36,
BUILDSTDERR:                  from /builddir/build/BUILD/openvdb-5.1.0/openvdb/MetaMap.h:34,
BUILDSTDERR:                  from /builddir/build/BUILD/openvdb-5.1.0/openvdb/Grid.h:35,
BUILDSTDERR:                  from /builddir/build/BUILD/openvdb-5.1.0/openvdb/points/PointDataGrid.h:43,
BUILDSTDERR:                  from /builddir/build/BUILD/openvdb-5.1.0/openvdb/points/points.cc:33:
BUILDSTDERR: /builddir/build/BUILD/openvdb-5.1.0/openvdb/math/Vec3.h:50:7: note: 'class openvdb::v5_1abi3::math::Vec3<float>' declared here
BUILDSTDERR:  class Vec3: public Tuple<3, T>
BUILDSTDERR:        ^~~~
BUILDSTDERR: In file included from /builddir/build/BUILD/openvdb-5.1.0/openvdb/points/PointDataGrid.h:47,
BUILDSTDERR:                  from /builddir/build/BUILD/openvdb-5.1.0/openvdb/points/points.cc:33:
BUILDSTDERR: /builddir/build/BUILD/openvdb-5.1.0/openvdb/points/AttributeArray.h: In instantiation of 'openvdb::v5_1abi3::points::TypedAttributeArray<ValueType_, Codec_>::TypedAttributeArray(const openvdb::v5_1abi3::points::TypedAttributeArray<ValueType_, Codec_>&, bool) [with ValueType_ = openvdb::v5_1abi3::math::Vec3<int>; Codec_ = openvdb::v5_1abi3::points::NullCodec]':
BUILDSTDERR: /builddir/build/BUILD/openvdb-5.1.0/openvdb/points/AttributeArray.h:1010:32:   required from 'openvdb::v5_1abi3::points::AttributeArray::Ptr openvdb::v5_1abi3::points::TypedAttributeArray<ValueType_, Codec_>::copy() const [with ValueType_ = openvdb::v5_1abi3::math::Vec3<int>; Codec_ = openvdb::v5_1abi3::points::NullCodec; openvdb::v5_1abi3::points::AttributeArray::Ptr = std::shared_ptr<openvdb::v5_1abi3::points::AttributeArray>]'
BUILDSTDERR: /builddir/build/BUILD/openvdb-5.1.0/openvdb/points/AttributeArray.h:1008:1:   required from here
BUILDSTDERR: /builddir/build/BUILD/openvdb-5.1.0/openvdb/points/AttributeArray.h:905:20: warning: 'void* memcpy(void*, const void*, size_t)' writing to an object of type 'class openvdb::v5_1abi3::math::Vec3<int>' with no trivial copy-assignment; use copy-assignment or copy-initialization instead [-Wclass-memaccess]
BUILDSTDERR:          std::memcpy(mData.get(), rhs.mData.get(), this->arrayMemUsage());
BUILDSTDERR:          ~~~~~~~~~~~^~~~~~~~~~~~~~~~~~~~~~~~~~~~~~~~~~~~~~~~~~~~~~~~~~~~~
BUILDSTDERR: In file included from /builddir/build/BUILD/openvdb-5.1.0/openvdb/math/BBox.h:35,
BUILDSTDERR:                  from /builddir/build/BUILD/openvdb-5.1.0/openvdb/Types.h:38,
BUILDSTDERR:                  from /builddir/build/BUILD/openvdb-5.1.0/openvdb/Metadata.h:36,
BUILDSTDERR:                  from /builddir/build/BUILD/openvdb-5.1.0/openvdb/MetaMap.h:34,
BUILDSTDERR:                  from /builddir/build/BUILD/openvdb-5.1.0/openvdb/Grid.h:35,
BUILDSTDERR:                  from /builddir/build/BUILD/openvdb-5.1.0/openvdb/points/PointDataGrid.h:43,
BUILDSTDERR:                  from /builddir/build/BUILD/openvdb-5.1.0/openvdb/points/points.cc:33:
BUILDSTDERR: /builddir/build/BUILD/openvdb-5.1.0/openvdb/math/Vec3.h:50:7: note: 'class openvdb::v5_1abi3::math::Vec3<int>' declared here
BUILDSTDERR:  class Vec3: public Tuple<3, T>
BUILDSTDERR:        ^~~~
make[2]: Entering directory '/builddir/build/BUILD/openvdb-5.1.0'
[ 25%] Building CXX object openvdb/CMakeFiles/openvdb_shared.dir/points/points.cc.o
cd /builddir/build/BUILD/openvdb-5.1.0/openvdb && /usr/bin/c++  -DOPENVDB_ABI_VERSION_NUMBER=3 -Dopenvdb_shared_EXPORTS -I/builddir/build/BUILD/openvdb-5.1.0 -I/builddir/build/BUILD/openvdb-5.1.0/openvdb/. -I/builddir/build/BUILD/openvdb-5.1.0/dwa -isystem /usr/include/OpenEXR  -O2 -g -pipe -Wall -Werror=format-security -Wp,-D_FORTIFY_SOURCE=2 -Wp,-D_GLIBCXX_ASSERTIONS -fexceptions -fstack-protector-strong -grecord-gcc-switches -specs=/usr/lib/rpm/redhat/redhat-hardened-cc1 -specs=/usr/lib/rpm/redhat/redhat-annobin-cc1 -fasynchronous-unwind-tables -fstack-clash-protection -Wl,--as-needed -fPIC   -pthread -fPIC -std=gnu++11 -DOPENVDB_PRIVATE -DOPENVDB_USE_BLOSC -DOPENVDB_USE_GLFW_3 -o CMakeFiles/openvdb_shared.dir/points/points.cc.o -c /builddir/build/BUILD/openvdb-5.1.0/openvdb/points/points.cc
make[2]: Leaving directory '/builddir/build/BUILD/openvdb-5.1.0'
BUILDSTDERR: In file included from /builddir/build/BUILD/openvdb-5.1.0/openvdb/points/PointDataGrid.h:47,
BUILDSTDERR:                  from /builddir/build/BUILD/openvdb-5.1.0/openvdb/points/points.cc:33:
BUILDSTDERR: /builddir/build/BUILD/openvdb-5.1.0/openvdb/points/AttributeArray.h: In instantiation of 'openvdb::v5_1abi3::points::TypedAttributeArray<ValueType_, Codec_>::TypedAttributeArray(const openvdb::v5_1abi3::points::TypedAttributeArray<ValueType_, Codec_>&, bool) [with ValueType_ = openvdb::v5_1abi3::math::Vec3<float>; Codec_ = openvdb::v5_1abi3::points::FixedPointCodec<false, openvdb::v5_1abi3::points::UnitRange>]':
BUILDSTDERR: /builddir/build/BUILD/openvdb-5.1.0/openvdb/points/AttributeArray.h:1010:32:   required from 'openvdb::v5_1abi3::points::AttributeArray::Ptr openvdb::v5_1abi3::points::TypedAttributeArray<ValueType_, Codec_>::copy() const [with ValueType_ = openvdb::v5_1abi3::math::Vec3<float>; Codec_ = openvdb::v5_1abi3::points::FixedPointCodec<false, openvdb::v5_1abi3::points::UnitRange>; openvdb::v5_1abi3::points::AttributeArray::Ptr = std::shared_ptr<openvdb::v5_1abi3::points::AttributeArray>]'
BUILDSTDERR: /builddir/build/BUILD/openvdb-5.1.0/openvdb/points/AttributeArray.h:1008:1:   required from here
BUILDSTDERR: /builddir/build/BUILD/openvdb-5.1.0/openvdb/points/AttributeArray.h:905:20: warning: 'void* memcpy(void*, const void*, size_t)' writing to an object of type 'class openvdb::v5_1abi3::math::Vec3<short unsigned int>' with no trivial copy-assignment; use copy-assignment or copy-initialization instead [-Wclass-memaccess]
BUILDSTDERR:          std::memcpy(mData.get(), rhs.mData.get(), this->arrayMemUsage());
BUILDSTDERR:          ~~~~~~~~~~~^~~~~~~~~~~~~~~~~~~~~~~~~~~~~~~~~~~~~~~~~~~~~~~~~~~~~
BUILDSTDERR: In file included from /builddir/build/BUILD/openvdb-5.1.0/openvdb/math/BBox.h:35,
BUILDSTDERR:                  from /builddir/build/BUILD/openvdb-5.1.0/openvdb/Types.h:38,
BUILDSTDERR:                  from /builddir/build/BUILD/openvdb-5.1.0/openvdb/Metadata.h:36,
BUILDSTDERR:                  from /builddir/build/BUILD/openvdb-5.1.0/openvdb/MetaMap.h:34,
BUILDSTDERR:                  from /builddir/build/BUILD/openvdb-5.1.0/openvdb/Grid.h:35,
BUILDSTDERR:                  from /builddir/build/BUILD/openvdb-5.1.0/openvdb/points/PointDataGrid.h:43,
BUILDSTDERR:                  from /builddir/build/BUILD/openvdb-5.1.0/openvdb/points/points.cc:33:
BUILDSTDERR: /builddir/build/BUILD/openvdb-5.1.0/openvdb/math/Vec3.h:50:7: note: 'class openvdb::v5_1abi3::math::Vec3<short unsigned int>' declared here
BUILDSTDERR:  class Vec3: public Tuple<3, T>
BUILDSTDERR:        ^~~~
BUILDSTDERR: In file included from /builddir/build/BUILD/openvdb-5.1.0/openvdb/points/PointDataGrid.h:47,
BUILDSTDERR:                  from /builddir/build/BUILD/openvdb-5.1.0/openvdb/points/points.cc:33:
BUILDSTDERR: /builddir/build/BUILD/openvdb-5.1.0/openvdb/points/AttributeArray.h: In instantiation of 'openvdb::v5_1abi3::points::TypedAttributeArray<ValueType_, Codec_>::TypedAttributeArray(const openvdb::v5_1abi3::points::TypedAttributeArray<ValueType_, Codec_>&, bool) [with ValueType_ = openvdb::v5_1abi3::math::Vec3<float>; Codec_ = openvdb::v5_1abi3::points::FixedPointCodec<true, openvdb::v5_1abi3::points::UnitRange>]':
BUILDSTDERR: /builddir/build/BUILD/openvdb-5.1.0/openvdb/points/AttributeArray.h:1010:32:   required from 'openvdb::v5_1abi3::points::AttributeArray::Ptr openvdb::v5_1abi3::points::TypedAttributeArray<ValueType_, Codec_>::copy() const [with ValueType_ = openvdb::v5_1abi3::math::Vec3<float>; Codec_ = openvdb::v5_1abi3::points::FixedPointCodec<true, openvdb::v5_1abi3::points::UnitRange>; openvdb::v5_1abi3::points::AttributeArray::Ptr = std::shared_ptr<openvdb::v5_1abi3::points::AttributeArray>]'
BUILDSTDERR: /builddir/build/BUILD/openvdb-5.1.0/openvdb/points/AttributeArray.h:1008:1:   required from here
BUILDSTDERR: /builddir/build/BUILD/openvdb-5.1.0/openvdb/points/AttributeArray.h:905:20: warning: 'void* memcpy(void*, const void*, size_t)' writing to an object of type 'class openvdb::v5_1abi3::math::Vec3<unsigned char>' with no trivial copy-assignment; use copy-assignment or copy-initialization instead [-Wclass-memaccess]
BUILDSTDERR:          std::memcpy(mData.get(), rhs.mData.get(), this->arrayMemUsage());
BUILDSTDERR:          ~~~~~~~~~~~^~~~~~~~~~~~~~~~~~~~~~~~~~~~~~~~~~~~~~~~~~~~~~~~~~~~~
BUILDSTDERR: In file included from /builddir/build/BUILD/openvdb-5.1.0/openvdb/math/BBox.h:35,
BUILDSTDERR:                  from /builddir/build/BUILD/openvdb-5.1.0/openvdb/Types.h:38,
BUILDSTDERR:                  from /builddir/build/BUILD/openvdb-5.1.0/openvdb/Metadata.h:36,
BUILDSTDERR:                  from /builddir/build/BUILD/openvdb-5.1.0/openvdb/MetaMap.h:34,
BUILDSTDERR:                  from /builddir/build/BUILD/openvdb-5.1.0/openvdb/Grid.h:35,
BUILDSTDERR:                  from /builddir/build/BUILD/openvdb-5.1.0/openvdb/points/PointDataGrid.h:43,
BUILDSTDERR:                  from /builddir/build/BUILD/openvdb-5.1.0/openvdb/points/points.cc:33:
BUILDSTDERR: /builddir/build/BUILD/openvdb-5.1.0/openvdb/math/Vec3.h:50:7: note: 'class openvdb::v5_1abi3::math::Vec3<unsigned char>' declared here
BUILDSTDERR:  class Vec3: public Tuple<3, T>
BUILDSTDERR:        ^~~~
BUILDSTDERR: In file included from /builddir/build/BUILD/openvdb-5.1.0/openvdb/points/PointDataGrid.h:47,
BUILDSTDERR:                  from /builddir/build/BUILD/openvdb-5.1.0/openvdb/points/points.cc:33:
BUILDSTDERR: /builddir/build/BUILD/openvdb-5.1.0/openvdb/points/AttributeArray.h: In instantiation of 'openvdb::v5_1abi3::points::TypedAttributeArray<ValueType_, Codec_>::TypedAttributeArray(const openvdb::v5_1abi3::points::TypedAttributeArray<ValueType_, Codec_>&, bool) [with ValueType_ = openvdb::v5_1abi3::math::Vec3<float>; Codec_ = openvdb::v5_1abi3::points::FixedPointCodec<false>]':
BUILDSTDERR: /builddir/build/BUILD/openvdb-5.1.0/openvdb/points/AttributeArray.h:1010:32:   required from 'openvdb::v5_1abi3::points::AttributeArray::Ptr openvdb::v5_1abi3::points::TypedAttributeArray<ValueType_, Codec_>::copy() const [with ValueType_ = openvdb::v5_1abi3::math::Vec3<float>; Codec_ = openvdb::v5_1abi3::points::FixedPointCodec<false>; openvdb::v5_1abi3::points::AttributeArray::Ptr = std::shared_ptr<openvdb::v5_1abi3::points::AttributeArray>]'
BUILDSTDERR: /builddir/build/BUILD/openvdb-5.1.0/openvdb/points/AttributeArray.h:1008:1:   required from here
BUILDSTDERR: /builddir/build/BUILD/openvdb-5.1.0/openvdb/points/AttributeArray.h:905:20: warning: 'void* memcpy(void*, const void*, size_t)' writing to an object of type 'class openvdb::v5_1abi3::math::Vec3<short unsigned int>' with no trivial copy-assignment; use copy-assignment or copy-initialization instead [-Wclass-memaccess]
BUILDSTDERR:          std::memcpy(mData.get(), rhs.mData.get(), this->arrayMemUsage());
BUILDSTDERR:          ~~~~~~~~~~~^~~~~~~~~~~~~~~~~~~~~~~~~~~~~~~~~~~~~~~~~~~~~~~~~~~~~
BUILDSTDERR: In file included from /builddir/build/BUILD/openvdb-5.1.0/openvdb/math/BBox.h:35,
BUILDSTDERR:                  from /builddir/build/BUILD/openvdb-5.1.0/openvdb/Types.h:38,
BUILDSTDERR:                  from /builddir/build/BUILD/openvdb-5.1.0/openvdb/Metadata.h:36,
BUILDSTDERR:                  from /builddir/build/BUILD/openvdb-5.1.0/openvdb/MetaMap.h:34,
BUILDSTDERR:                  from /builddir/build/BUILD/openvdb-5.1.0/openvdb/Grid.h:35,
BUILDSTDERR:                  from /builddir/build/BUILD/openvdb-5.1.0/openvdb/points/PointDataGrid.h:43,
BUILDSTDERR:                  from /builddir/build/BUILD/openvdb-5.1.0/openvdb/points/points.cc:33:
BUILDSTDERR: /builddir/build/BUILD/openvdb-5.1.0/openvdb/math/Vec3.h:50:7: note: 'class openvdb::v5_1abi3::math::Vec3<short unsigned int>' declared here
BUILDSTDERR:  class Vec3: public Tuple<3, T>
BUILDSTDERR:        ^~~~
BUILDSTDERR: In file included from /builddir/build/BUILD/openvdb-5.1.0/openvdb/points/PointDataGrid.h:47,
BUILDSTDERR:                  from /builddir/build/BUILD/openvdb-5.1.0/openvdb/points/points.cc:33:
BUILDSTDERR: /builddir/build/BUILD/openvdb-5.1.0/openvdb/points/AttributeArray.h: In instantiation of 'openvdb::v5_1abi3::points::TypedAttributeArray<ValueType_, Codec_>::TypedAttributeArray(const openvdb::v5_1abi3::points::TypedAttributeArray<ValueType_, Codec_>&, bool) [with ValueType_ = openvdb::v5_1abi3::math::Vec3<float>; Codec_ = openvdb::v5_1abi3::points::FixedPointCodec<true>]':
BUILDSTDERR: /builddir/build/BUILD/openvdb-5.1.0/openvdb/points/AttributeArray.h:1010:32:   required from 'openvdb::v5_1abi3::points::AttributeArray::Ptr openvdb::v5_1abi3::points::TypedAttributeArray<ValueType_, Codec_>::copy() const [with ValueType_ = openvdb::v5_1abi3::math::Vec3<float>; Codec_ = openvdb::v5_1abi3::points::FixedPointCodec<true>; openvdb::v5_1abi3::points::AttributeArray::Ptr = std::shared_ptr<openvdb::v5_1abi3::points::AttributeArray>]'
BUILDSTDERR: /builddir/build/BUILD/openvdb-5.1.0/openvdb/points/AttributeArray.h:1008:1:   required from here
BUILDSTDERR: /builddir/build/BUILD/openvdb-5.1.0/openvdb/points/AttributeArray.h:905:20: warning: 'void* memcpy(void*, const void*, size_t)' writing to an object of type 'class openvdb::v5_1abi3::math::Vec3<unsigned char>' with no trivial copy-assignment; use copy-assignment or copy-initialization instead [-Wclass-memaccess]
BUILDSTDERR:          std::memcpy(mData.get(), rhs.mData.get(), this->arrayMemUsage());
BUILDSTDERR:          ~~~~~~~~~~~^~~~~~~~~~~~~~~~~~~~~~~~~~~~~~~~~~~~~~~~~~~~~~~~~~~~~
BUILDSTDERR: In file included from /builddir/build/BUILD/openvdb-5.1.0/openvdb/math/BBox.h:35,
BUILDSTDERR:                  from /builddir/build/BUILD/openvdb-5.1.0/openvdb/Types.h:38,
BUILDSTDERR:                  from /builddir/build/BUILD/openvdb-5.1.0/openvdb/Metadata.h:36,
BUILDSTDERR:                  from /builddir/build/BUILD/openvdb-5.1.0/openvdb/MetaMap.h:34,
BUILDSTDERR:                  from /builddir/build/BUILD/openvdb-5.1.0/openvdb/Grid.h:35,
BUILDSTDERR:                  from /builddir/build/BUILD/openvdb-5.1.0/openvdb/points/PointDataGrid.h:43,
BUILDSTDERR:                  from /builddir/build/BUILD/openvdb-5.1.0/openvdb/points/points.cc:33:
BUILDSTDERR: /builddir/build/BUILD/openvdb-5.1.0/openvdb/math/Vec3.h:50:7: note: 'class openvdb::v5_1abi3::math::Vec3<unsigned char>' declared here
BUILDSTDERR:  class Vec3: public Tuple<3, T>
BUILDSTDERR:        ^~~~
BUILDSTDERR: In file included from /builddir/build/BUILD/openvdb-5.1.0/openvdb/points/PointDataGrid.h:47,
BUILDSTDERR:                  from /builddir/build/BUILD/openvdb-5.1.0/openvdb/points/points.cc:33:
BUILDSTDERR: /builddir/build/BUILD/openvdb-5.1.0/openvdb/points/AttributeArray.h: In instantiation of 'openvdb::v5_1abi3::points::TypedAttributeArray<ValueType_, Codec_>::TypedAttributeArray(const openvdb::v5_1abi3::points::TypedAttributeArray<ValueType_, Codec_>&, bool) [with ValueType_ = openvdb::v5_1abi3::math::Vec3<float>; Codec_ = openvdb::v5_1abi3::points::TruncateCodec]':
BUILDSTDERR: /builddir/build/BUILD/openvdb-5.1.0/openvdb/points/AttributeArray.h:1010:32:   required from 'openvdb::v5_1abi3::points::AttributeArray::Ptr openvdb::v5_1abi3::points::TypedAttributeArray<ValueType_, Codec_>::copy() const [with ValueType_ = openvdb::v5_1abi3::math::Vec3<float>; Codec_ = openvdb::v5_1abi3::points::TruncateCodec; openvdb::v5_1abi3::points::AttributeArray::Ptr = std::shared_ptr<openvdb::v5_1abi3::points::AttributeArray>]'
BUILDSTDERR: /builddir/build/BUILD/openvdb-5.1.0/openvdb/points/AttributeArray.h:1008:1:   required from here
BUILDSTDERR: /builddir/build/BUILD/openvdb-5.1.0/openvdb/points/AttributeArray.h:905:20: warning: 'void* memcpy(void*, const void*, size_t)' writing to an object of type 'class openvdb::v5_1abi3::math::Vec3<half>' with no trivial copy-assignment; use copy-assignment or copy-initialization instead [-Wclass-memaccess]
BUILDSTDERR:          std::memcpy(mData.get(), rhs.mData.get(), this->arrayMemUsage());
BUILDSTDERR:          ~~~~~~~~~~~^~~~~~~~~~~~~~~~~~~~~~~~~~~~~~~~~~~~~~~~~~~~~~~~~~~~~
BUILDSTDERR: In file included from /builddir/build/BUILD/openvdb-5.1.0/openvdb/math/BBox.h:35,
BUILDSTDERR:                  from /builddir/build/BUILD/openvdb-5.1.0/openvdb/Types.h:38,
BUILDSTDERR:                  from /builddir/build/BUILD/openvdb-5.1.0/openvdb/Metadata.h:36,
BUILDSTDERR:                  from /builddir/build/BUILD/openvdb-5.1.0/openvdb/MetaMap.h:34,
BUILDSTDERR:                  from /builddir/build/BUILD/openvdb-5.1.0/openvdb/Grid.h:35,
BUILDSTDERR:                  from /builddir/build/BUILD/openvdb-5.1.0/openvdb/points/PointDataGrid.h:43,
BUILDSTDERR:                  from /builddir/build/BUILD/openvdb-5.1.0/openvdb/points/points.cc:33:
BUILDSTDERR: /builddir/build/BUILD/openvdb-5.1.0/openvdb/math/Vec3.h:50:7: note: 'class openvdb::v5_1abi3::math::Vec3<half>' declared here
BUILDSTDERR:  class Vec3: public Tuple<3, T>
BUILDSTDERR:        ^~~~
BUILDSTDERR: In file included from /builddir/build/BUILD/openvdb-5.1.0/openvdb/points/PointDataGrid.h:47,
BUILDSTDERR:                  from /builddir/build/BUILD/openvdb-5.1.0/openvdb/points/points.cc:33:
BUILDSTDERR: /builddir/build/BUILD/openvdb-5.1.0/openvdb/points/AttributeArray.h: In instantiation of 'openvdb::v5_1abi3::points::TypedAttributeArray<ValueType_, Codec_>::TypedAttributeArray(const openvdb::v5_1abi3::points::TypedAttributeArray<ValueType_, Codec_>&, bool) [with ValueType_ = float; Codec_ = openvdb::v5_1abi3::points::TruncateCodec]':
BUILDSTDERR: /builddir/build/BUILD/openvdb-5.1.0/openvdb/points/AttributeArray.h:1010:32:   required from 'openvdb::v5_1abi3::points::AttributeArray::Ptr openvdb::v5_1abi3::points::TypedAttributeArray<ValueType_, Codec_>::copy() const [with ValueType_ = float; Codec_ = openvdb::v5_1abi3::points::TruncateCodec; openvdb::v5_1abi3::points::AttributeArray::Ptr = std::shared_ptr<openvdb::v5_1abi3::points::AttributeArray>]'
BUILDSTDERR: /builddir/build/BUILD/openvdb-5.1.0/openvdb/points/AttributeArray.h:1008:1:   required from here
BUILDSTDERR: /builddir/build/BUILD/openvdb-5.1.0/openvdb/points/AttributeArray.h:905:20: warning: 'void* memcpy(void*, const void*, size_t)' writing to an object of type 'class half' with no trivial copy-assignment; use copy-assignment or copy-initialization instead [-Wclass-memaccess]
BUILDSTDERR:          std::memcpy(mData.get(), rhs.mData.get(), this->arrayMemUsage());
BUILDSTDERR:          ~~~~~~~~~~~^~~~~~~~~~~~~~~~~~~~~~~~~~~~~~~~~~~~~~~~~~~~~~~~~~~~~
BUILDSTDERR: In file included from /builddir/build/BUILD/openvdb-5.1.0/openvdb/Types.h:36,
BUILDSTDERR:                  from /builddir/build/BUILD/openvdb-5.1.0/openvdb/Metadata.h:36,
BUILDSTDERR:                  from /builddir/build/BUILD/openvdb-5.1.0/openvdb/MetaMap.h:34,
BUILDSTDERR:                  from /builddir/build/BUILD/openvdb-5.1.0/openvdb/Grid.h:35,
BUILDSTDERR:                  from /builddir/build/BUILD/openvdb-5.1.0/openvdb/points/PointDataGrid.h:43,
BUILDSTDERR:                  from /builddir/build/BUILD/openvdb-5.1.0/openvdb/points/points.cc:33:
BUILDSTDERR: /usr/include/OpenEXR/half.h:91:7: note: 'class half' declared here
BUILDSTDERR:  class half
BUILDSTDERR:        ^~~~
BUILDSTDERR: In file included from /builddir/build/BUILD/openvdb-5.1.0/openvdb/points/PointDataGrid.h:47,
BUILDSTDERR:                  from /builddir/build/BUILD/openvdb-5.1.0/openvdb/points/points.cc:33:
BUILDSTDERR: /builddir/build/BUILD/openvdb-5.1.0/openvdb/points/AttributeArray.h: In instantiation of 'openvdb::v5_1abi3::points::TypedAttributeArray<ValueType_, Codec_>::TypedAttributeArray(const openvdb::v5_1abi3::points::TypedAttributeArray<ValueType_, Codec_>&, bool) [with ValueType_ = openvdb::v5_1abi3::math::Quat<double>; Codec_ = openvdb::v5_1abi3::points::NullCodec]':
BUILDSTDERR: /builddir/build/BUILD/openvdb-5.1.0/openvdb/points/AttributeArray.h:1010:32:   required from 'openvdb::v5_1abi3::points::AttributeArray::Ptr openvdb::v5_1abi3::points::TypedAttributeArray<ValueType_, Codec_>::copy() const [with ValueType_ = openvdb::v5_1abi3::math::Quat<double>; Codec_ = openvdb::v5_1abi3::points::NullCodec; openvdb::v5_1abi3::points::AttributeArray::Ptr = std::shared_ptr<openvdb::v5_1abi3::points::AttributeArray>]'
BUILDSTDERR: /builddir/build/BUILD/openvdb-5.1.0/openvdb/points/AttributeArray.h:1008:1:   required from here
BUILDSTDERR: /builddir/build/BUILD/openvdb-5.1.0/openvdb/points/AttributeArray.h:905:20: warning: 'void* memcpy(void*, const void*, size_t)' writing to an object of type 'class openvdb::v5_1abi3::math::Quat<double>' with no trivial copy-assignment; use copy-assignment or copy-initialization instead [-Wclass-memaccess]
BUILDSTDERR:          std::memcpy(mData.get(), rhs.mData.get(), this->arrayMemUsage());
BUILDSTDERR:          ~~~~~~~~~~~^~~~~~~~~~~~~~~~~~~~~~~~~~~~~~~~~~~~~~~~~~~~~~~~~~~~~
BUILDSTDERR: In file included from /builddir/build/BUILD/openvdb-5.1.0/openvdb/Types.h:39,
BUILDSTDERR:                  from /builddir/build/BUILD/openvdb-5.1.0/openvdb/Metadata.h:36,
BUILDSTDERR:                  from /builddir/build/BUILD/openvdb-5.1.0/openvdb/MetaMap.h:34,
BUILDSTDERR:                  from /builddir/build/BUILD/openvdb-5.1.0/openvdb/Grid.h:35,
BUILDSTDERR:                  from /builddir/build/BUILD/openvdb-5.1.0/openvdb/points/PointDataGrid.h:43,
BUILDSTDERR:                  from /builddir/build/BUILD/openvdb-5.1.0/openvdb/points/points.cc:33:
BUILDSTDERR: /builddir/build/BUILD/openvdb-5.1.0/openvdb/math/Quat.h:105:7: note: 'class openvdb::v5_1abi3::math::Quat<double>' declared here
BUILDSTDERR:  class Quat
BUILDSTDERR:        ^~~~
BUILDSTDERR: In file included from /builddir/build/BUILD/openvdb-5.1.0/openvdb/points/PointDataGrid.h:47,
BUILDSTDERR:                  from /builddir/build/BUILD/openvdb-5.1.0/openvdb/points/points.cc:33:
BUILDSTDERR: /builddir/build/BUILD/openvdb-5.1.0/openvdb/points/AttributeArray.h: In instantiation of 'openvdb::v5_1abi3::points::TypedAttributeArray<ValueType_, Codec_>::TypedAttributeArray(const openvdb::v5_1abi3::points::TypedAttributeArray<ValueType_, Codec_>&, bool) [with ValueType_ = openvdb::v5_1abi3::math::Quat<float>; Codec_ = openvdb::v5_1abi3::points::NullCodec]':
BUILDSTDERR: /builddir/build/BUILD/openvdb-5.1.0/openvdb/points/AttributeArray.h:1010:32:   required from 'openvdb::v5_1abi3::points::AttributeArray::Ptr openvdb::v5_1abi3::points::TypedAttributeArray<ValueType_, Codec_>::copy() const [with ValueType_ = openvdb::v5_1abi3::math::Quat<float>; Codec_ = openvdb::v5_1abi3::points::NullCodec; openvdb::v5_1abi3::points::AttributeArray::Ptr = std::shared_ptr<openvdb::v5_1abi3::points::AttributeArray>]'
BUILDSTDERR: /builddir/build/BUILD/openvdb-5.1.0/openvdb/points/AttributeArray.h:1008:1:   required from here
BUILDSTDERR: /builddir/build/BUILD/openvdb-5.1.0/openvdb/points/AttributeArray.h:905:20: warning: 'void* memcpy(void*, const void*, size_t)' writing to an object of type 'class openvdb::v5_1abi3::math::Quat<float>' with no trivial copy-assignment; use copy-assignment or copy-initialization instead [-Wclass-memaccess]
BUILDSTDERR:          std::memcpy(mData.get(), rhs.mData.get(), this->arrayMemUsage());
BUILDSTDERR:          ~~~~~~~~~~~^~~~~~~~~~~~~~~~~~~~~~~~~~~~~~~~~~~~~~~~~~~~~~~~~~~~~
BUILDSTDERR: In file included from /builddir/build/BUILD/openvdb-5.1.0/openvdb/Types.h:39,
BUILDSTDERR:                  from /builddir/build/BUILD/openvdb-5.1.0/openvdb/Metadata.h:36,
BUILDSTDERR:                  from /builddir/build/BUILD/openvdb-5.1.0/openvdb/MetaMap.h:34,
BUILDSTDERR:                  from /builddir/build/BUILD/openvdb-5.1.0/openvdb/Grid.h:35,
BUILDSTDERR:                  from /builddir/build/BUILD/openvdb-5.1.0/openvdb/points/PointDataGrid.h:43,
BUILDSTDERR:                  from /builddir/build/BUILD/openvdb-5.1.0/openvdb/points/points.cc:33:
BUILDSTDERR: /builddir/build/BUILD/openvdb-5.1.0/openvdb/math/Quat.h:105:7: note: 'class openvdb::v5_1abi3::math::Quat<float>' declared here
BUILDSTDERR:  class Quat
BUILDSTDERR:        ^~~~
BUILDSTDERR: In file included from /builddir/build/BUILD/openvdb-5.1.0/openvdb/points/PointDataGrid.h:47,
BUILDSTDERR:                  from /builddir/build/BUILD/openvdb-5.1.0/openvdb/points/points.cc:33:
BUILDSTDERR: /builddir/build/BUILD/openvdb-5.1.0/openvdb/points/AttributeArray.h: In instantiation of 'openvdb::v5_1abi3::points::TypedAttributeArray<ValueType_, Codec_>::TypedAttributeArray(const openvdb::v5_1abi3::points::TypedAttributeArray<ValueType_, Codec_>&, bool) [with ValueType_ = openvdb::v5_1abi3::math::Mat4<double>; Codec_ = openvdb::v5_1abi3::points::NullCodec]':
BUILDSTDERR: /builddir/build/BUILD/openvdb-5.1.0/openvdb/points/AttributeArray.h:1010:32:   required from 'openvdb::v5_1abi3::points::AttributeArray::Ptr openvdb::v5_1abi3::points::TypedAttributeArray<ValueType_, Codec_>::copy() const [with ValueType_ = openvdb::v5_1abi3::math::Mat4<double>; Codec_ = openvdb::v5_1abi3::points::NullCodec; openvdb::v5_1abi3::points::AttributeArray::Ptr = std::shared_ptr<openvdb::v5_1abi3::points::AttributeArray>]'
BUILDSTDERR: /builddir/build/BUILD/openvdb-5.1.0/openvdb/points/AttributeArray.h:1008:1:   required from here
BUILDSTDERR: /builddir/build/BUILD/openvdb-5.1.0/openvdb/points/AttributeArray.h:905:20: warning: 'void* memcpy(void*, const void*, size_t)' writing to an object of type 'class openvdb::v5_1abi3::math::Mat4<double>' with no trivial copy-assignment; use copy-assignment or copy-initialization instead [-Wclass-memaccess]
BUILDSTDERR:          std::memcpy(mData.get(), rhs.mData.get(), this->arrayMemUsage());
BUILDSTDERR:          ~~~~~~~~~~~^~~~~~~~~~~~~~~~~~~~~~~~~~~~~~~~~~~~~~~~~~~~~~~~~~~~~
BUILDSTDERR: In file included from /builddir/build/BUILD/openvdb-5.1.0/openvdb/Types.h:44,
BUILDSTDERR:                  from /builddir/build/BUILD/openvdb-5.1.0/openvdb/Metadata.h:36,
BUILDSTDERR:                  from /builddir/build/BUILD/openvdb-5.1.0/openvdb/MetaMap.h:34,
BUILDSTDERR:                  from /builddir/build/BUILD/openvdb-5.1.0/openvdb/Grid.h:35,
BUILDSTDERR:                  from /builddir/build/BUILD/openvdb-5.1.0/openvdb/points/PointDataGrid.h:43,
BUILDSTDERR:                  from /builddir/build/BUILD/openvdb-5.1.0/openvdb/points/points.cc:33:
BUILDSTDERR: /builddir/build/BUILD/openvdb-5.1.0/openvdb/math/Mat4.h:57:7: note: 'class openvdb::v5_1abi3::math::Mat4<double>' declared here
BUILDSTDERR:  class Mat4: public Mat<4, T>
BUILDSTDERR:        ^~~~
BUILDSTDERR: In file included from /builddir/build/BUILD/openvdb-5.1.0/openvdb/points/PointDataGrid.h:47,
BUILDSTDERR:                  from /builddir/build/BUILD/openvdb-5.1.0/openvdb/points/points.cc:33:
BUILDSTDERR: /builddir/build/BUILD/openvdb-5.1.0/openvdb/points/AttributeArray.h: In instantiation of 'openvdb::v5_1abi3::points::TypedAttributeArray<ValueType_, Codec_>::TypedAttributeArray(const openvdb::v5_1abi3::points::TypedAttributeArray<ValueType_, Codec_>&, bool) [with ValueType_ = openvdb::v5_1abi3::math::Mat4<float>; Codec_ = openvdb::v5_1abi3::points::NullCodec]':
BUILDSTDERR: /builddir/build/BUILD/openvdb-5.1.0/openvdb/points/AttributeArray.h:1010:32:   required from 'openvdb::v5_1abi3::points::AttributeArray::Ptr openvdb::v5_1abi3::points::TypedAttributeArray<ValueType_, Codec_>::copy() const [with ValueType_ = openvdb::v5_1abi3::math::Mat4<float>; Codec_ = openvdb::v5_1abi3::points::NullCodec; openvdb::v5_1abi3::points::AttributeArray::Ptr = std::shared_ptr<openvdb::v5_1abi3::points::AttributeArray>]'
BUILDSTDERR: /builddir/build/BUILD/openvdb-5.1.0/openvdb/points/AttributeArray.h:1008:1:   required from here
BUILDSTDERR: /builddir/build/BUILD/openvdb-5.1.0/openvdb/points/AttributeArray.h:905:20: warning: 'void* memcpy(void*, const void*, size_t)' writing to an object of type 'class openvdb::v5_1abi3::math::Mat4<float>' with no trivial copy-assignment; use copy-assignment or copy-initialization instead [-Wclass-memaccess]
BUILDSTDERR:          std::memcpy(mData.get(), rhs.mData.get(), this->arrayMemUsage());
BUILDSTDERR:          ~~~~~~~~~~~^~~~~~~~~~~~~~~~~~~~~~~~~~~~~~~~~~~~~~~~~~~~~~~~~~~~~
BUILDSTDERR: In file included from /builddir/build/BUILD/openvdb-5.1.0/openvdb/Types.h:44,
BUILDSTDERR:                  from /builddir/build/BUILD/openvdb-5.1.0/openvdb/Metadata.h:36,
BUILDSTDERR:                  from /builddir/build/BUILD/openvdb-5.1.0/openvdb/MetaMap.h:34,
BUILDSTDERR:                  from /builddir/build/BUILD/openvdb-5.1.0/openvdb/Grid.h:35,
BUILDSTDERR:                  from /builddir/build/BUILD/openvdb-5.1.0/openvdb/points/PointDataGrid.h:43,
BUILDSTDERR:                  from /builddir/build/BUILD/openvdb-5.1.0/openvdb/points/points.cc:33:
BUILDSTDERR: /builddir/build/BUILD/openvdb-5.1.0/openvdb/math/Mat4.h:57:7: note: 'class openvdb::v5_1abi3::math::Mat4<float>' declared here
BUILDSTDERR:  class Mat4: public Mat<4, T>
BUILDSTDERR:        ^~~~
BUILDSTDERR: In file included from /builddir/build/BUILD/openvdb-5.1.0/openvdb/points/PointDataGrid.h:47,
BUILDSTDERR:                  from /builddir/build/BUILD/openvdb-5.1.0/openvdb/points/points.cc:33:
BUILDSTDERR: /builddir/build/BUILD/openvdb-5.1.0/openvdb/points/AttributeArray.h: In instantiation of 'openvdb::v5_1abi3::points::TypedAttributeArray<ValueType_, Codec_>::TypedAttributeArray(const openvdb::v5_1abi3::points::TypedAttributeArray<ValueType_, Codec_>&, bool) [with ValueType_ = openvdb::v5_1abi3::math::Mat3<double>; Codec_ = openvdb::v5_1abi3::points::NullCodec]':
BUILDSTDERR: /builddir/build/BUILD/openvdb-5.1.0/openvdb/points/AttributeArray.h:1010:32:   required from 'openvdb::v5_1abi3::points::AttributeArray::Ptr openvdb::v5_1abi3::points::TypedAttributeArray<ValueType_, Codec_>::copy() const [with ValueType_ = openvdb::v5_1abi3::math::Mat3<double>; Codec_ = openvdb::v5_1abi3::points::NullCodec; openvdb::v5_1abi3::points::AttributeArray::Ptr = std::shared_ptr<openvdb::v5_1abi3::points::AttributeArray>]'
BUILDSTDERR: /builddir/build/BUILD/openvdb-5.1.0/openvdb/points/AttributeArray.h:1008:1:   required from here
BUILDSTDERR: /builddir/build/BUILD/openvdb-5.1.0/openvdb/points/AttributeArray.h:905:20: warning: 'void* memcpy(void*, const void*, size_t)' writing to an object of type 'class openvdb::v5_1abi3::math::Mat3<double>' with no trivial copy-assignment; use copy-assignment or copy-initialization instead [-Wclass-memaccess]
BUILDSTDERR:          std::memcpy(mData.get(), rhs.mData.get(), this->arrayMemUsage());
BUILDSTDERR:          ~~~~~~~~~~~^~~~~~~~~~~~~~~~~~~~~~~~~~~~~~~~~~~~~~~~~~~~~~~~~~~~~
BUILDSTDERR: In file included from /builddir/build/BUILD/openvdb-5.1.0/openvdb/math/Quat.h:35,
BUILDSTDERR:                  from /builddir/build/BUILD/openvdb-5.1.0/openvdb/Types.h:39,
BUILDSTDERR:                  from /builddir/build/BUILD/openvdb-5.1.0/openvdb/Metadata.h:36,
BUILDSTDERR:                  from /builddir/build/BUILD/openvdb-5.1.0/openvdb/MetaMap.h:34,
BUILDSTDERR:                  from /builddir/build/BUILD/openvdb-5.1.0/openvdb/Grid.h:35,
BUILDSTDERR:                  from /builddir/build/BUILD/openvdb-5.1.0/openvdb/points/PointDataGrid.h:43,
BUILDSTDERR:                  from /builddir/build/BUILD/openvdb-5.1.0/openvdb/points/points.cc:33:
BUILDSTDERR: /builddir/build/BUILD/openvdb-5.1.0/openvdb/math/Mat3.h:55:7: note: 'class openvdb::v5_1abi3::math::Mat3<double>' declared here
BUILDSTDERR:  class Mat3: public Mat<3, T>
BUILDSTDERR:        ^~~~
BUILDSTDERR: In file included from /builddir/build/BUILD/openvdb-5.1.0/openvdb/points/PointDataGrid.h:47,
BUILDSTDERR:                  from /builddir/build/BUILD/openvdb-5.1.0/openvdb/points/points.cc:33:
BUILDSTDERR: /builddir/build/BUILD/openvdb-5.1.0/openvdb/points/AttributeArray.h: In instantiation of 'openvdb::v5_1abi3::points::TypedAttributeArray<ValueType_, Codec_>::TypedAttributeArray(const openvdb::v5_1abi3::points::TypedAttributeArray<ValueType_, Codec_>&, bool) [with ValueType_ = openvdb::v5_1abi3::math::Mat3<float>; Codec_ = openvdb::v5_1abi3::points::NullCodec]':
BUILDSTDERR: /builddir/build/BUILD/openvdb-5.1.0/openvdb/points/AttributeArray.h:1010:32:   required from 'openvdb::v5_1abi3::points::AttributeArray::Ptr openvdb::v5_1abi3::points::TypedAttributeArray<ValueType_, Codec_>::copy() const [with ValueType_ = openvdb::v5_1abi3::math::Mat3<float>; Codec_ = openvdb::v5_1abi3::points::NullCodec; openvdb::v5_1abi3::points::AttributeArray::Ptr = std::shared_ptr<openvdb::v5_1abi3::points::AttributeArray>]'
BUILDSTDERR: /builddir/build/BUILD/openvdb-5.1.0/openvdb/points/AttributeArray.h:1008:1:   required from here
BUILDSTDERR: /builddir/build/BUILD/openvdb-5.1.0/openvdb/points/AttributeArray.h:905:20: warning: 'void* memcpy(void*, const void*, size_t)' writing to an object of type 'class openvdb::v5_1abi3::math::Mat3<float>' with no trivial copy-assignment; use copy-assignment or copy-initialization instead [-Wclass-memaccess]
BUILDSTDERR:          std::memcpy(mData.get(), rhs.mData.get(), this->arrayMemUsage());
BUILDSTDERR:          ~~~~~~~~~~~^~~~~~~~~~~~~~~~~~~~~~~~~~~~~~~~~~~~~~~~~~~~~~~~~~~~~
BUILDSTDERR: In file included from /builddir/build/BUILD/openvdb-5.1.0/openvdb/math/Quat.h:35,
BUILDSTDERR:                  from /builddir/build/BUILD/openvdb-5.1.0/openvdb/Types.h:39,
BUILDSTDERR:                  from /builddir/build/BUILD/openvdb-5.1.0/openvdb/Metadata.h:36,
BUILDSTDERR:                  from /builddir/build/BUILD/openvdb-5.1.0/openvdb/MetaMap.h:34,
BUILDSTDERR:                  from /builddir/build/BUILD/openvdb-5.1.0/openvdb/Grid.h:35,
BUILDSTDERR:                  from /builddir/build/BUILD/openvdb-5.1.0/openvdb/points/PointDataGrid.h:43,
BUILDSTDERR:                  from /builddir/build/BUILD/openvdb-5.1.0/openvdb/points/points.cc:33:
BUILDSTDERR: /builddir/build/BUILD/openvdb-5.1.0/openvdb/math/Mat3.h:55:7: note: 'class openvdb::v5_1abi3::math::Mat3<float>' declared here
BUILDSTDERR:  class Mat3: public Mat<3, T>
BUILDSTDERR:        ^~~~
BUILDSTDERR: In file included from /builddir/build/BUILD/openvdb-5.1.0/openvdb/points/PointDataGrid.h:47,
BUILDSTDERR:                  from /builddir/build/BUILD/openvdb-5.1.0/openvdb/points/points.cc:33:
BUILDSTDERR: /builddir/build/BUILD/openvdb-5.1.0/openvdb/points/AttributeArray.h: In instantiation of 'openvdb::v5_1abi3::points::TypedAttributeArray<ValueType_, Codec_>::TypedAttributeArray(const openvdb::v5_1abi3::points::TypedAttributeArray<ValueType_, Codec_>&, bool) [with ValueType_ = openvdb::v5_1abi3::math::Vec3<double>; Codec_ = openvdb::v5_1abi3::points::NullCodec]':
BUILDSTDERR: /builddir/build/BUILD/openvdb-5.1.0/openvdb/points/AttributeArray.h:1010:32:   required from 'openvdb::v5_1abi3::points::AttributeArray::Ptr openvdb::v5_1abi3::points::TypedAttributeArray<ValueType_, Codec_>::copy() const [with ValueType_ = openvdb::v5_1abi3::math::Vec3<double>; Codec_ = openvdb::v5_1abi3::points::NullCodec; openvdb::v5_1abi3::points::AttributeArray::Ptr = std::shared_ptr<openvdb::v5_1abi3::points::AttributeArray>]'
BUILDSTDERR: /builddir/build/BUILD/openvdb-5.1.0/openvdb/points/AttributeArray.h:1008:1:   required from here
BUILDSTDERR: /builddir/build/BUILD/openvdb-5.1.0/openvdb/points/AttributeArray.h:905:20: warning: 'void* memcpy(void*, const void*, size_t)' writing to an object of type 'class openvdb::v5_1abi3::math::Vec3<double>' with no trivial copy-assignment; use copy-assignment or copy-initialization instead [-Wclass-memaccess]
BUILDSTDERR:          std::memcpy(mData.get(), rhs.mData.get(), this->arrayMemUsage());
BUILDSTDERR:          ~~~~~~~~~~~^~~~~~~~~~~~~~~~~~~~~~~~~~~~~~~~~~~~~~~~~~~~~~~~~~~~~
BUILDSTDERR: In file included from /builddir/build/BUILD/openvdb-5.1.0/openvdb/math/BBox.h:35,
BUILDSTDERR:                  from /builddir/build/BUILD/openvdb-5.1.0/openvdb/Types.h:38,
BUILDSTDERR:                  from /builddir/build/BUILD/openvdb-5.1.0/openvdb/Metadata.h:36,
BUILDSTDERR:                  from /builddir/build/BUILD/openvdb-5.1.0/openvdb/MetaMap.h:34,
BUILDSTDERR:                  from /builddir/build/BUILD/openvdb-5.1.0/openvdb/Grid.h:35,
BUILDSTDERR:                  from /builddir/build/BUILD/openvdb-5.1.0/openvdb/points/PointDataGrid.h:43,
BUILDSTDERR:                  from /builddir/build/BUILD/openvdb-5.1.0/openvdb/points/points.cc:33:
BUILDSTDERR: /builddir/build/BUILD/openvdb-5.1.0/openvdb/math/Vec3.h:50:7: note: 'class openvdb::v5_1abi3::math::Vec3<double>' declared here
BUILDSTDERR:  class Vec3: public Tuple<3, T>
BUILDSTDERR:        ^~~~
BUILDSTDERR: In file included from /builddir/build/BUILD/openvdb-5.1.0/openvdb/points/PointDataGrid.h:47,
BUILDSTDERR:                  from /builddir/build/BUILD/openvdb-5.1.0/openvdb/points/points.cc:33:
BUILDSTDERR: /builddir/build/BUILD/openvdb-5.1.0/openvdb/points/AttributeArray.h: In instantiation of 'openvdb::v5_1abi3::points::TypedAttributeArray<ValueType_, Codec_>::TypedAttributeArray(const openvdb::v5_1abi3::points::TypedAttributeArray<ValueType_, Codec_>&, bool) [with ValueType_ = openvdb::v5_1abi3::math::Vec3<float>; Codec_ = openvdb::v5_1abi3::points::NullCodec]':
BUILDSTDERR: /builddir/build/BUILD/openvdb-5.1.0/openvdb/points/AttributeArray.h:1010:32:   required from 'openvdb::v5_1abi3::points::AttributeArray::Ptr openvdb::v5_1abi3::points::TypedAttributeArray<ValueType_, Codec_>::copy() const [with ValueType_ = openvdb::v5_1abi3::math::Vec3<float>; Codec_ = openvdb::v5_1abi3::points::NullCodec; openvdb::v5_1abi3::points::AttributeArray::Ptr = std::shared_ptr<openvdb::v5_1abi3::points::AttributeArray>]'
BUILDSTDERR: /builddir/build/BUILD/openvdb-5.1.0/openvdb/points/AttributeArray.h:1008:1:   required from here
BUILDSTDERR: /builddir/build/BUILD/openvdb-5.1.0/openvdb/points/AttributeArray.h:905:20: warning: 'void* memcpy(void*, const void*, size_t)' writing to an object of type 'class openvdb::v5_1abi3::math::Vec3<float>' with no trivial copy-assignment; use copy-assignment or copy-initialization instead [-Wclass-memaccess]
BUILDSTDERR:          std::memcpy(mData.get(), rhs.mData.get(), this->arrayMemUsage());
BUILDSTDERR:          ~~~~~~~~~~~^~~~~~~~~~~~~~~~~~~~~~~~~~~~~~~~~~~~~~~~~~~~~~~~~~~~~
BUILDSTDERR: In file included from /builddir/build/BUILD/openvdb-5.1.0/openvdb/math/BBox.h:35,
BUILDSTDERR:                  from /builddir/build/BUILD/openvdb-5.1.0/openvdb/Types.h:38,
BUILDSTDERR:                  from /builddir/build/BUILD/openvdb-5.1.0/openvdb/Metadata.h:36,
BUILDSTDERR:                  from /builddir/build/BUILD/openvdb-5.1.0/openvdb/MetaMap.h:34,
BUILDSTDERR:                  from /builddir/build/BUILD/openvdb-5.1.0/openvdb/Grid.h:35,
BUILDSTDERR:                  from /builddir/build/BUILD/openvdb-5.1.0/openvdb/points/PointDataGrid.h:43,
BUILDSTDERR:                  from /builddir/build/BUILD/openvdb-5.1.0/openvdb/points/points.cc:33:
BUILDSTDERR: /builddir/build/BUILD/openvdb-5.1.0/openvdb/math/Vec3.h:50:7: note: 'class openvdb::v5_1abi3::math::Vec3<float>' declared here
BUILDSTDERR:  class Vec3: public Tuple<3, T>
BUILDSTDERR:        ^~~~
BUILDSTDERR: In file included from /builddir/build/BUILD/openvdb-5.1.0/openvdb/points/PointDataGrid.h:47,
BUILDSTDERR:                  from /builddir/build/BUILD/openvdb-5.1.0/openvdb/points/points.cc:33:
BUILDSTDERR: /builddir/build/BUILD/openvdb-5.1.0/openvdb/points/AttributeArray.h: In instantiation of 'openvdb::v5_1abi3::points::TypedAttributeArray<ValueType_, Codec_>::TypedAttributeArray(const openvdb::v5_1abi3::points::TypedAttributeArray<ValueType_, Codec_>&, bool) [with ValueType_ = openvdb::v5_1abi3::math::Vec3<int>; Codec_ = openvdb::v5_1abi3::points::NullCodec]':
BUILDSTDERR: /builddir/build/BUILD/openvdb-5.1.0/openvdb/points/AttributeArray.h:1010:32:   required from 'openvdb::v5_1abi3::points::AttributeArray::Ptr openvdb::v5_1abi3::points::TypedAttributeArray<ValueType_, Codec_>::copy() const [with ValueType_ = openvdb::v5_1abi3::math::Vec3<int>; Codec_ = openvdb::v5_1abi3::points::NullCodec; openvdb::v5_1abi3::points::AttributeArray::Ptr = std::shared_ptr<openvdb::v5_1abi3::points::AttributeArray>]'
BUILDSTDERR: /builddir/build/BUILD/openvdb-5.1.0/openvdb/points/AttributeArray.h:1008:1:   required from here
BUILDSTDERR: /builddir/build/BUILD/openvdb-5.1.0/openvdb/points/AttributeArray.h:905:20: warning: 'void* memcpy(void*, const void*, size_t)' writing to an object of type 'class openvdb::v5_1abi3::math::Vec3<int>' with no trivial copy-assignment; use copy-assignment or copy-initialization instead [-Wclass-memaccess]
BUILDSTDERR:          std::memcpy(mData.get(), rhs.mData.get(), this->arrayMemUsage());
BUILDSTDERR:          ~~~~~~~~~~~^~~~~~~~~~~~~~~~~~~~~~~~~~~~~~~~~~~~~~~~~~~~~~~~~~~~~
BUILDSTDERR: In file included from /builddir/build/BUILD/openvdb-5.1.0/openvdb/math/BBox.h:35,
BUILDSTDERR:                  from /builddir/build/BUILD/openvdb-5.1.0/openvdb/Types.h:38,
BUILDSTDERR:                  from /builddir/build/BUILD/openvdb-5.1.0/openvdb/Metadata.h:36,
BUILDSTDERR:                  from /builddir/build/BUILD/openvdb-5.1.0/openvdb/MetaMap.h:34,
BUILDSTDERR:                  from /builddir/build/BUILD/openvdb-5.1.0/openvdb/Grid.h:35,
BUILDSTDERR:                  from /builddir/build/BUILD/openvdb-5.1.0/openvdb/points/PointDataGrid.h:43,
BUILDSTDERR:                  from /builddir/build/BUILD/openvdb-5.1.0/openvdb/points/points.cc:33:
BUILDSTDERR: /builddir/build/BUILD/openvdb-5.1.0/openvdb/math/Vec3.h:50:7: note: 'class openvdb::v5_1abi3::math::Vec3<int>' declared here
BUILDSTDERR:  class Vec3: public Tuple<3, T>
BUILDSTDERR:        ^~~~
make[2]: Entering directory '/builddir/build/BUILD/openvdb-5.1.0'
[ 28%] Building CXX object openvdb/CMakeFiles/openvdb_shared.dir/util/Formats.cc.o
cd /builddir/build/BUILD/openvdb-5.1.0/openvdb && /usr/bin/c++  -DOPENVDB_ABI_VERSION_NUMBER=3 -Dopenvdb_shared_EXPORTS -I/builddir/build/BUILD/openvdb-5.1.0 -I/builddir/build/BUILD/openvdb-5.1.0/openvdb/. -I/builddir/build/BUILD/openvdb-5.1.0/dwa -isystem /usr/include/OpenEXR  -O2 -g -pipe -Wall -Werror=format-security -Wp,-D_FORTIFY_SOURCE=2 -Wp,-D_GLIBCXX_ASSERTIONS -fexceptions -fstack-protector-strong -grecord-gcc-switches -specs=/usr/lib/rpm/redhat/redhat-hardened-cc1 -specs=/usr/lib/rpm/redhat/redhat-annobin-cc1 -fasynchronous-unwind-tables -fstack-clash-protection -Wl,--as-needed -fPIC   -pthread -fPIC -std=gnu++11 -DOPENVDB_PRIVATE -DOPENVDB_USE_BLOSC -DOPENVDB_USE_GLFW_3 -o CMakeFiles/openvdb_shared.dir/util/Formats.cc.o -c /builddir/build/BUILD/openvdb-5.1.0/openvdb/util/Formats.cc
make[2]: Leaving directory '/builddir/build/BUILD/openvdb-5.1.0'
make[2]: Entering directory '/builddir/build/BUILD/openvdb-5.1.0'
[ 29%] Building CXX object openvdb/CMakeFiles/openvdb_static.dir/util/Formats.cc.o
cd /builddir/build/BUILD/openvdb-5.1.0/openvdb && /usr/bin/c++  -DOPENVDB_ABI_VERSION_NUMBER=3 -I/builddir/build/BUILD/openvdb-5.1.0 -I/builddir/build/BUILD/openvdb-5.1.0/openvdb/. -I/builddir/build/BUILD/openvdb-5.1.0/dwa -isystem /usr/include/OpenEXR  -O2 -g -pipe -Wall -Werror=format-security -Wp,-D_FORTIFY_SOURCE=2 -Wp,-D_GLIBCXX_ASSERTIONS -fexceptions -fstack-protector-strong -grecord-gcc-switches -specs=/usr/lib/rpm/redhat/redhat-hardened-cc1 -specs=/usr/lib/rpm/redhat/redhat-annobin-cc1 -fasynchronous-unwind-tables -fstack-clash-protection -Wl,--as-needed   -pthread -fPIC -std=gnu++11 -DOPENVDB_PRIVATE -DOPENVDB_USE_BLOSC -DOPENVDB_USE_GLFW_3 -o CMakeFiles/openvdb_static.dir/util/Formats.cc.o -c /builddir/build/BUILD/openvdb-5.1.0/openvdb/util/Formats.cc
make[2]: Leaving directory '/builddir/build/BUILD/openvdb-5.1.0'
make[2]: Entering directory '/builddir/build/BUILD/openvdb-5.1.0'
[ 29%] Building CXX object openvdb/CMakeFiles/openvdb_shared.dir/util/Util.cc.o
cd /builddir/build/BUILD/openvdb-5.1.0/openvdb && /usr/bin/c++  -DOPENVDB_ABI_VERSION_NUMBER=3 -Dopenvdb_shared_EXPORTS -I/builddir/build/BUILD/openvdb-5.1.0 -I/builddir/build/BUILD/openvdb-5.1.0/openvdb/. -I/builddir/build/BUILD/openvdb-5.1.0/dwa -isystem /usr/include/OpenEXR  -O2 -g -pipe -Wall -Werror=format-security -Wp,-D_FORTIFY_SOURCE=2 -Wp,-D_GLIBCXX_ASSERTIONS -fexceptions -fstack-protector-strong -grecord-gcc-switches -specs=/usr/lib/rpm/redhat/redhat-hardened-cc1 -specs=/usr/lib/rpm/redhat/redhat-annobin-cc1 -fasynchronous-unwind-tables -fstack-clash-protection -Wl,--as-needed -fPIC   -pthread -fPIC -std=gnu++11 -DOPENVDB_PRIVATE -DOPENVDB_USE_BLOSC -DOPENVDB_USE_GLFW_3 -o CMakeFiles/openvdb_shared.dir/util/Util.cc.o -c /builddir/build/BUILD/openvdb-5.1.0/openvdb/util/Util.cc
make[2]: Leaving directory '/builddir/build/BUILD/openvdb-5.1.0'
make[2]: Entering directory '/builddir/build/BUILD/openvdb-5.1.0'
[ 30%] Building CXX object openvdb/CMakeFiles/openvdb_static.dir/util/Util.cc.o
cd /builddir/build/BUILD/openvdb-5.1.0/openvdb && /usr/bin/c++  -DOPENVDB_ABI_VERSION_NUMBER=3 -I/builddir/build/BUILD/openvdb-5.1.0 -I/builddir/build/BUILD/openvdb-5.1.0/openvdb/. -I/builddir/build/BUILD/openvdb-5.1.0/dwa -isystem /usr/include/OpenEXR  -O2 -g -pipe -Wall -Werror=format-security -Wp,-D_FORTIFY_SOURCE=2 -Wp,-D_GLIBCXX_ASSERTIONS -fexceptions -fstack-protector-strong -grecord-gcc-switches -specs=/usr/lib/rpm/redhat/redhat-hardened-cc1 -specs=/usr/lib/rpm/redhat/redhat-annobin-cc1 -fasynchronous-unwind-tables -fstack-clash-protection -Wl,--as-needed   -pthread -fPIC -std=gnu++11 -DOPENVDB_PRIVATE -DOPENVDB_USE_BLOSC -DOPENVDB_USE_GLFW_3 -o CMakeFiles/openvdb_static.dir/util/Util.cc.o -c /builddir/build/BUILD/openvdb-5.1.0/openvdb/util/Util.cc
make[2]: Leaving directory '/builddir/build/BUILD/openvdb-5.1.0'
make[2]: Entering directory '/builddir/build/BUILD/openvdb-5.1.0'
[ 27%] Building CXX object openvdb/CMakeFiles/openvdb_shared.dir/openvdb.cc.o
cd /builddir/build/BUILD/openvdb-5.1.0/openvdb && /usr/bin/c++  -DOPENVDB_ABI_VERSION_NUMBER=3 -Dopenvdb_shared_EXPORTS -I/builddir/build/BUILD/openvdb-5.1.0 -I/builddir/build/BUILD/openvdb-5.1.0/openvdb/. -I/builddir/build/BUILD/openvdb-5.1.0/dwa -isystem /usr/include/OpenEXR  -O2 -g -pipe -Wall -Werror=format-security -Wp,-D_FORTIFY_SOURCE=2 -Wp,-D_GLIBCXX_ASSERTIONS -fexceptions -fstack-protector-strong -grecord-gcc-switches -specs=/usr/lib/rpm/redhat/redhat-hardened-cc1 -specs=/usr/lib/rpm/redhat/redhat-annobin-cc1 -fasynchronous-unwind-tables -fstack-clash-protection -Wl,--as-needed -fPIC   -pthread -fPIC -std=gnu++11 -DOPENVDB_PRIVATE -DOPENVDB_USE_BLOSC -DOPENVDB_USE_GLFW_3 -o CMakeFiles/openvdb_shared.dir/openvdb.cc.o -c /builddir/build/BUILD/openvdb-5.1.0/openvdb/openvdb.cc
make[2]: Leaving directory '/builddir/build/BUILD/openvdb-5.1.0'
make[2]: Entering directory '/builddir/build/BUILD/openvdb-5.1.0'
[ 28%] Building CXX object openvdb/CMakeFiles/openvdb_static.dir/openvdb.cc.o
cd /builddir/build/BUILD/openvdb-5.1.0/openvdb && /usr/bin/c++  -DOPENVDB_ABI_VERSION_NUMBER=3 -I/builddir/build/BUILD/openvdb-5.1.0 -I/builddir/build/BUILD/openvdb-5.1.0/openvdb/. -I/builddir/build/BUILD/openvdb-5.1.0/dwa -isystem /usr/include/OpenEXR  -O2 -g -pipe -Wall -Werror=format-security -Wp,-D_FORTIFY_SOURCE=2 -Wp,-D_GLIBCXX_ASSERTIONS -fexceptions -fstack-protector-strong -grecord-gcc-switches -specs=/usr/lib/rpm/redhat/redhat-hardened-cc1 -specs=/usr/lib/rpm/redhat/redhat-annobin-cc1 -fasynchronous-unwind-tables -fstack-clash-protection -Wl,--as-needed   -pthread -fPIC -std=gnu++11 -DOPENVDB_PRIVATE -DOPENVDB_USE_BLOSC -DOPENVDB_USE_GLFW_3 -o CMakeFiles/openvdb_static.dir/openvdb.cc.o -c /builddir/build/BUILD/openvdb-5.1.0/openvdb/openvdb.cc
make[2]: Leaving directory '/builddir/build/BUILD/openvdb-5.1.0'
make[2]: Entering directory '/builddir/build/BUILD/openvdb-5.1.0'
[ 32%] Linking CXX static library libopenvdb.a
cd /builddir/build/BUILD/openvdb-5.1.0/openvdb && /usr/bin/cmake -P CMakeFiles/openvdb_static.dir/cmake_clean_target.cmake
cd /builddir/build/BUILD/openvdb-5.1.0/openvdb && /usr/bin/cmake -E cmake_link_script CMakeFiles/openvdb_static.dir/link.txt --verbose=1
/usr/bin/ar qc libopenvdb.a  CMakeFiles/openvdb_static.dir/Grid.cc.o CMakeFiles/openvdb_static.dir/MetaMap.cc.o CMakeFiles/openvdb_static.dir/Metadata.cc.o CMakeFiles/openvdb_static.dir/Platform.cc.o CMakeFiles/openvdb_static.dir/io/Archive.cc.o CMakeFiles/openvdb_static.dir/io/Compression.cc.o CMakeFiles/openvdb_static.dir/io/File.cc.o CMakeFiles/openvdb_static.dir/io/GridDescriptor.cc.o CMakeFiles/openvdb_static.dir/io/Queue.cc.o CMakeFiles/openvdb_static.dir/io/Stream.cc.o CMakeFiles/openvdb_static.dir/io/TempFile.cc.o CMakeFiles/openvdb_static.dir/math/Maps.cc.o CMakeFiles/openvdb_static.dir/math/Proximity.cc.o CMakeFiles/openvdb_static.dir/math/QuantizedUnitVec.cc.o CMakeFiles/openvdb_static.dir/math/Transform.cc.o CMakeFiles/openvdb_static.dir/points/AttributeArray.cc.o CMakeFiles/openvdb_static.dir/points/AttributeArrayString.cc.o CMakeFiles/openvdb_static.dir/points/AttributeGroup.cc.o CMakeFiles/openvdb_static.dir/points/AttributeSet.cc.o CMakeFiles/openvdb_static.dir/points/StreamCompression.cc.o CMakeFiles/openvdb_static.dir/points/points.cc.o CMakeFiles/openvdb_static.dir/openvdb.cc.o CMakeFiles/openvdb_static.dir/util/Formats.cc.o CMakeFiles/openvdb_static.dir/util/Util.cc.o
/usr/bin/ranlib libopenvdb.a
make[2]: Leaving directory '/builddir/build/BUILD/openvdb-5.1.0'
make[1]: Entering directory '/builddir/build/BUILD/openvdb-5.1.0'
[ 32%] Built target openvdb_static
make[1]: Leaving directory '/builddir/build/BUILD/openvdb-5.1.0'
make[2]: Entering directory '/builddir/build/BUILD/openvdb-5.1.0'
[ 31%] Linking CXX shared library libopenvdb.so
cd /builddir/build/BUILD/openvdb-5.1.0/openvdb && /usr/bin/cmake -E cmake_link_script CMakeFiles/openvdb_shared.dir/link.txt --verbose=1
/usr/bin/c++ -fPIC -O2 -g -pipe -Wall -Werror=format-security -Wp,-D_FORTIFY_SOURCE=2 -Wp,-D_GLIBCXX_ASSERTIONS -fexceptions -fstack-protector-strong -grecord-gcc-switches -specs=/usr/lib/rpm/redhat/redhat-hardened-cc1 -specs=/usr/lib/rpm/redhat/redhat-annobin-cc1 -fasynchronous-unwind-tables -fstack-clash-protection -Wl,--as-needed -Wl,-z,relro   -Wl,-z,now -specs=/usr/lib/rpm/redhat/redhat-hardened-ld -shared -Wl,-soname,libopenvdb.so.5.1 -o libopenvdb.so.5.1.0 CMakeFiles/openvdb_shared.dir/Grid.cc.o CMakeFiles/openvdb_shared.dir/MetaMap.cc.o CMakeFiles/openvdb_shared.dir/Metadata.cc.o CMakeFiles/openvdb_shared.dir/Platform.cc.o CMakeFiles/openvdb_shared.dir/io/Archive.cc.o CMakeFiles/openvdb_shared.dir/io/Compression.cc.o CMakeFiles/openvdb_shared.dir/io/File.cc.o CMakeFiles/openvdb_shared.dir/io/GridDescriptor.cc.o CMakeFiles/openvdb_shared.dir/io/Queue.cc.o CMakeFiles/openvdb_shared.dir/io/Stream.cc.o CMakeFiles/openvdb_shared.dir/io/TempFile.cc.o CMakeFiles/openvdb_shared.dir/math/Maps.cc.o CMakeFiles/openvdb_shared.dir/math/Proximity.cc.o CMakeFiles/openvdb_shared.dir/math/QuantizedUnitVec.cc.o CMakeFiles/openvdb_shared.dir/math/Transform.cc.o CMakeFiles/openvdb_shared.dir/points/AttributeArray.cc.o CMakeFiles/openvdb_shared.dir/points/AttributeArrayString.cc.o CMakeFiles/openvdb_shared.dir/points/AttributeGroup.cc.o CMakeFiles/openvdb_shared.dir/points/AttributeSet.cc.o CMakeFiles/openvdb_shared.dir/points/StreamCompression.cc.o CMakeFiles/openvdb_shared.dir/points/points.cc.o CMakeFiles/openvdb_shared.dir/openvdb.cc.o CMakeFiles/openvdb_shared.dir/util/Formats.cc.o CMakeFiles/openvdb_shared.dir/util/Util.cc.o -lboost_iostreams -lboost_system -ltbb -lHalf -lz -lblosc 
cd /builddir/build/BUILD/openvdb-5.1.0/openvdb && /usr/bin/cmake -E cmake_symlink_library libopenvdb.so.5.1.0 libopenvdb.so.5.1 libopenvdb.so
make[2]: Leaving directory '/builddir/build/BUILD/openvdb-5.1.0'
make[1]: Entering directory '/builddir/build/BUILD/openvdb-5.1.0'
[ 32%] Built target openvdb_shared
make[1]: Leaving directory '/builddir/build/BUILD/openvdb-5.1.0'
/usr/bin/make -f openvdb/CMakeFiles/vdb_print.dir/build.make openvdb/CMakeFiles/vdb_print.dir/depend
/usr/bin/make -f openvdb/CMakeFiles/vdb_render.dir/build.make openvdb/CMakeFiles/vdb_render.dir/depend
/usr/bin/make -f openvdb/CMakeFiles/vdb_view.dir/build.make openvdb/CMakeFiles/vdb_view.dir/depend
/usr/bin/make -f openvdb/CMakeFiles/vdb_test.dir/build.make openvdb/CMakeFiles/vdb_test.dir/depend
make[2]: Entering directory '/builddir/build/BUILD/openvdb-5.1.0'
cd /builddir/build/BUILD/openvdb-5.1.0 && /usr/bin/cmake -E cmake_depends "Unix Makefiles" /builddir/build/BUILD/openvdb-5.1.0 /builddir/build/BUILD/openvdb-5.1.0/openvdb /builddir/build/BUILD/openvdb-5.1.0 /builddir/build/BUILD/openvdb-5.1.0/openvdb /builddir/build/BUILD/openvdb-5.1.0/openvdb/CMakeFiles/vdb_print.dir/DependInfo.cmake --color=
Scanning dependencies of target vdb_print
make[2]: Leaving directory '/builddir/build/BUILD/openvdb-5.1.0'
/usr/bin/make -f openvdb/CMakeFiles/vdb_print.dir/build.make openvdb/CMakeFiles/vdb_print.dir/build
make[2]: Entering directory '/builddir/build/BUILD/openvdb-5.1.0'
cd /builddir/build/BUILD/openvdb-5.1.0 && /usr/bin/cmake -E cmake_depends "Unix Makefiles" /builddir/build/BUILD/openvdb-5.1.0 /builddir/build/BUILD/openvdb-5.1.0/openvdb /builddir/build/BUILD/openvdb-5.1.0 /builddir/build/BUILD/openvdb-5.1.0/openvdb /builddir/build/BUILD/openvdb-5.1.0/openvdb/CMakeFiles/vdb_render.dir/DependInfo.cmake --color=
Scanning dependencies of target vdb_render
make[2]: Leaving directory '/builddir/build/BUILD/openvdb-5.1.0'
/usr/bin/make -f openvdb/CMakeFiles/vdb_render.dir/build.make openvdb/CMakeFiles/vdb_render.dir/build
make[2]: Entering directory '/builddir/build/BUILD/openvdb-5.1.0'
cd /builddir/build/BUILD/openvdb-5.1.0 && /usr/bin/cmake -E cmake_depends "Unix Makefiles" /builddir/build/BUILD/openvdb-5.1.0 /builddir/build/BUILD/openvdb-5.1.0/openvdb /builddir/build/BUILD/openvdb-5.1.0 /builddir/build/BUILD/openvdb-5.1.0/openvdb /builddir/build/BUILD/openvdb-5.1.0/openvdb/CMakeFiles/vdb_view.dir/DependInfo.cmake --color=
Scanning dependencies of target vdb_view
make[2]: Leaving directory '/builddir/build/BUILD/openvdb-5.1.0'
/usr/bin/make -f openvdb/CMakeFiles/vdb_view.dir/build.make openvdb/CMakeFiles/vdb_view.dir/build
make[2]: Entering directory '/builddir/build/BUILD/openvdb-5.1.0'
cd /builddir/build/BUILD/openvdb-5.1.0 && /usr/bin/cmake -E cmake_depends "Unix Makefiles" /builddir/build/BUILD/openvdb-5.1.0 /builddir/build/BUILD/openvdb-5.1.0/openvdb /builddir/build/BUILD/openvdb-5.1.0 /builddir/build/BUILD/openvdb-5.1.0/openvdb /builddir/build/BUILD/openvdb-5.1.0/openvdb/CMakeFiles/vdb_test.dir/DependInfo.cmake --color=
Scanning dependencies of target vdb_test
make[2]: Leaving directory '/builddir/build/BUILD/openvdb-5.1.0'
/usr/bin/make -f openvdb/CMakeFiles/vdb_test.dir/build.make openvdb/CMakeFiles/vdb_test.dir/build
make[2]: Entering directory '/builddir/build/BUILD/openvdb-5.1.0'
[ 35%] Building CXX object openvdb/CMakeFiles/vdb_test.dir/unittest/main.cc.o
cd /builddir/build/BUILD/openvdb-5.1.0/openvdb && /usr/bin/c++  -DOPENVDB_ABI_VERSION_NUMBER=3 -I/builddir/build/BUILD/openvdb-5.1.0 -I/builddir/build/BUILD/openvdb-5.1.0/openvdb/. -I/builddir/build/BUILD/openvdb-5.1.0/dwa -isystem /usr/include/OpenEXR  -O2 -g -pipe -Wall -Werror=format-security -Wp,-D_FORTIFY_SOURCE=2 -Wp,-D_GLIBCXX_ASSERTIONS -fexceptions -fstack-protector-strong -grecord-gcc-switches -specs=/usr/lib/rpm/redhat/redhat-hardened-cc1 -specs=/usr/lib/rpm/redhat/redhat-annobin-cc1 -fasynchronous-unwind-tables -fstack-clash-protection -Wl,--as-needed   -pthread -fPIC -std=gnu++11 -DOPENVDB_USE_BLOSC -o CMakeFiles/vdb_test.dir/unittest/main.cc.o -c /builddir/build/BUILD/openvdb-5.1.0/openvdb/unittest/main.cc
make[2]: Leaving directory '/builddir/build/BUILD/openvdb-5.1.0'
make[2]: Entering directory '/builddir/build/BUILD/openvdb-5.1.0'
[ 35%] Building CXX object openvdb/CMakeFiles/vdb_view.dir/cmd/openvdb_view/main.cc.o
cd /builddir/build/BUILD/openvdb-5.1.0/openvdb && /usr/bin/c++  -DOPENVDB_ABI_VERSION_NUMBER=3 -I/builddir/build/BUILD/openvdb-5.1.0 -I/builddir/build/BUILD/openvdb-5.1.0/openvdb/. -I/builddir/build/BUILD/openvdb-5.1.0/dwa -isystem /usr/include/OpenEXR  -O2 -g -pipe -Wall -Werror=format-security -Wp,-D_FORTIFY_SOURCE=2 -Wp,-D_GLIBCXX_ASSERTIONS -fexceptions -fstack-protector-strong -grecord-gcc-switches -specs=/usr/lib/rpm/redhat/redhat-hardened-cc1 -specs=/usr/lib/rpm/redhat/redhat-annobin-cc1 -fasynchronous-unwind-tables -fstack-clash-protection -Wl,--as-needed   -pthread -fPIC -std=gnu++11 -DOPENVDB_USE_BLOSC -DOPENVDB_USE_GLFW_3 -DGL_GLEXT_PROTOTYPES=1 -o CMakeFiles/vdb_view.dir/cmd/openvdb_view/main.cc.o -c /builddir/build/BUILD/openvdb-5.1.0/openvdb/cmd/openvdb_view/main.cc
make[2]: Leaving directory '/builddir/build/BUILD/openvdb-5.1.0'
make[2]: Entering directory '/builddir/build/BUILD/openvdb-5.1.0'
[ 36%] Building CXX object openvdb/CMakeFiles/vdb_view.dir/viewer/Camera.cc.o
cd /builddir/build/BUILD/openvdb-5.1.0/openvdb && /usr/bin/c++  -DOPENVDB_ABI_VERSION_NUMBER=3 -I/builddir/build/BUILD/openvdb-5.1.0 -I/builddir/build/BUILD/openvdb-5.1.0/openvdb/. -I/builddir/build/BUILD/openvdb-5.1.0/dwa -isystem /usr/include/OpenEXR  -O2 -g -pipe -Wall -Werror=format-security -Wp,-D_FORTIFY_SOURCE=2 -Wp,-D_GLIBCXX_ASSERTIONS -fexceptions -fstack-protector-strong -grecord-gcc-switches -specs=/usr/lib/rpm/redhat/redhat-hardened-cc1 -specs=/usr/lib/rpm/redhat/redhat-annobin-cc1 -fasynchronous-unwind-tables -fstack-clash-protection -Wl,--as-needed   -pthread -fPIC -std=gnu++11 -DOPENVDB_USE_BLOSC -DOPENVDB_USE_GLFW_3 -DGL_GLEXT_PROTOTYPES=1 -o CMakeFiles/vdb_view.dir/viewer/Camera.cc.o -c /builddir/build/BUILD/openvdb-5.1.0/openvdb/viewer/Camera.cc
make[2]: Leaving directory '/builddir/build/BUILD/openvdb-5.1.0'
make[2]: Entering directory '/builddir/build/BUILD/openvdb-5.1.0'
[ 37%] Building CXX object openvdb/CMakeFiles/vdb_view.dir/viewer/ClipBox.cc.o
cd /builddir/build/BUILD/openvdb-5.1.0/openvdb && /usr/bin/c++  -DOPENVDB_ABI_VERSION_NUMBER=3 -I/builddir/build/BUILD/openvdb-5.1.0 -I/builddir/build/BUILD/openvdb-5.1.0/openvdb/. -I/builddir/build/BUILD/openvdb-5.1.0/dwa -isystem /usr/include/OpenEXR  -O2 -g -pipe -Wall -Werror=format-security -Wp,-D_FORTIFY_SOURCE=2 -Wp,-D_GLIBCXX_ASSERTIONS -fexceptions -fstack-protector-strong -grecord-gcc-switches -specs=/usr/lib/rpm/redhat/redhat-hardened-cc1 -specs=/usr/lib/rpm/redhat/redhat-annobin-cc1 -fasynchronous-unwind-tables -fstack-clash-protection -Wl,--as-needed   -pthread -fPIC -std=gnu++11 -DOPENVDB_USE_BLOSC -DOPENVDB_USE_GLFW_3 -DGL_GLEXT_PROTOTYPES=1 -o CMakeFiles/vdb_view.dir/viewer/ClipBox.cc.o -c /builddir/build/BUILD/openvdb-5.1.0/openvdb/viewer/ClipBox.cc
make[2]: Leaving directory '/builddir/build/BUILD/openvdb-5.1.0'
make[2]: Entering directory '/builddir/build/BUILD/openvdb-5.1.0'
[ 38%] Building CXX object openvdb/CMakeFiles/vdb_view.dir/viewer/Font.cc.o
cd /builddir/build/BUILD/openvdb-5.1.0/openvdb && /usr/bin/c++  -DOPENVDB_ABI_VERSION_NUMBER=3 -I/builddir/build/BUILD/openvdb-5.1.0 -I/builddir/build/BUILD/openvdb-5.1.0/openvdb/. -I/builddir/build/BUILD/openvdb-5.1.0/dwa -isystem /usr/include/OpenEXR  -O2 -g -pipe -Wall -Werror=format-security -Wp,-D_FORTIFY_SOURCE=2 -Wp,-D_GLIBCXX_ASSERTIONS -fexceptions -fstack-protector-strong -grecord-gcc-switches -specs=/usr/lib/rpm/redhat/redhat-hardened-cc1 -specs=/usr/lib/rpm/redhat/redhat-annobin-cc1 -fasynchronous-unwind-tables -fstack-clash-protection -Wl,--as-needed   -pthread -fPIC -std=gnu++11 -DOPENVDB_USE_BLOSC -DOPENVDB_USE_GLFW_3 -DGL_GLEXT_PROTOTYPES=1 -o CMakeFiles/vdb_view.dir/viewer/Font.cc.o -c /builddir/build/BUILD/openvdb-5.1.0/openvdb/viewer/Font.cc
make[2]: Leaving directory '/builddir/build/BUILD/openvdb-5.1.0'
make[2]: Entering directory '/builddir/build/BUILD/openvdb-5.1.0'
[ 34%] Building CXX object openvdb/CMakeFiles/vdb_render.dir/cmd/openvdb_render/main.cc.o
cd /builddir/build/BUILD/openvdb-5.1.0/openvdb && /usr/bin/c++  -DOPENVDB_ABI_VERSION_NUMBER=3 -I/builddir/build/BUILD/openvdb-5.1.0 -I/builddir/build/BUILD/openvdb-5.1.0/openvdb/. -I/builddir/build/BUILD/openvdb-5.1.0/dwa -isystem /usr/include/OpenEXR  -O2 -g -pipe -Wall -Werror=format-security -Wp,-D_FORTIFY_SOURCE=2 -Wp,-D_GLIBCXX_ASSERTIONS -fexceptions -fstack-protector-strong -grecord-gcc-switches -specs=/usr/lib/rpm/redhat/redhat-hardened-cc1 -specs=/usr/lib/rpm/redhat/redhat-annobin-cc1 -fasynchronous-unwind-tables -fstack-clash-protection -Wl,--as-needed   -pthread -fPIC -std=gnu++11 -DOPENVDB_USE_BLOSC -DOPENVDB_USE_GLFW_3 -o CMakeFiles/vdb_render.dir/cmd/openvdb_render/main.cc.o -c /builddir/build/BUILD/openvdb-5.1.0/openvdb/cmd/openvdb_render/main.cc
make[2]: Leaving directory '/builddir/build/BUILD/openvdb-5.1.0'
make[2]: Entering directory '/builddir/build/BUILD/openvdb-5.1.0'
[ 39%] Linking CXX executable vdb_render
cd /builddir/build/BUILD/openvdb-5.1.0/openvdb && /usr/bin/cmake -E cmake_link_script CMakeFiles/vdb_render.dir/link.txt --verbose=1
/usr/bin/c++  -O2 -g -pipe -Wall -Werror=format-security -Wp,-D_FORTIFY_SOURCE=2 -Wp,-D_GLIBCXX_ASSERTIONS -fexceptions -fstack-protector-strong -grecord-gcc-switches -specs=/usr/lib/rpm/redhat/redhat-hardened-cc1 -specs=/usr/lib/rpm/redhat/redhat-annobin-cc1 -fasynchronous-unwind-tables -fstack-clash-protection -Wl,--as-needed  -Wl,-z,relro   -Wl,-z,now -specs=/usr/lib/rpm/redhat/redhat-hardened-ld -rdynamic CMakeFiles/vdb_render.dir/cmd/openvdb_render/main.cc.o  -o vdb_render -Wl,-rpath,/builddir/build/BUILD/openvdb-5.1.0/openvdb: libopenvdb.so.5.1.0 -lpthread -lblosc -lIlmImf -lIlmThread -lIex -lm -lstdc++ -lboost_iostreams -lboost_system -ltbb -lHalf -lz -lblosc 
make[2]: Leaving directory '/builddir/build/BUILD/openvdb-5.1.0'
make[1]: Entering directory '/builddir/build/BUILD/openvdb-5.1.0'
[ 39%] Built target vdb_render
make[1]: Leaving directory '/builddir/build/BUILD/openvdb-5.1.0'
make[2]: Entering directory '/builddir/build/BUILD/openvdb-5.1.0'
[ 40%] Building CXX object openvdb/CMakeFiles/vdb_view.dir/viewer/Viewer.cc.o
cd /builddir/build/BUILD/openvdb-5.1.0/openvdb && /usr/bin/c++  -DOPENVDB_ABI_VERSION_NUMBER=3 -I/builddir/build/BUILD/openvdb-5.1.0 -I/builddir/build/BUILD/openvdb-5.1.0/openvdb/. -I/builddir/build/BUILD/openvdb-5.1.0/dwa -isystem /usr/include/OpenEXR  -O2 -g -pipe -Wall -Werror=format-security -Wp,-D_FORTIFY_SOURCE=2 -Wp,-D_GLIBCXX_ASSERTIONS -fexceptions -fstack-protector-strong -grecord-gcc-switches -specs=/usr/lib/rpm/redhat/redhat-hardened-cc1 -specs=/usr/lib/rpm/redhat/redhat-annobin-cc1 -fasynchronous-unwind-tables -fstack-clash-protection -Wl,--as-needed   -pthread -fPIC -std=gnu++11 -DOPENVDB_USE_BLOSC -DOPENVDB_USE_GLFW_3 -DGL_GLEXT_PROTOTYPES=1 -o CMakeFiles/vdb_view.dir/viewer/Viewer.cc.o -c /builddir/build/BUILD/openvdb-5.1.0/openvdb/viewer/Viewer.cc
make[2]: Leaving directory '/builddir/build/BUILD/openvdb-5.1.0'
/usr/bin/make -f openvdb/python/CMakeFiles/pyopenvdb.dir/build.make openvdb/python/CMakeFiles/pyopenvdb.dir/depend
make[2]: Entering directory '/builddir/build/BUILD/openvdb-5.1.0'
cd /builddir/build/BUILD/openvdb-5.1.0 && /usr/bin/cmake -E cmake_depends "Unix Makefiles" /builddir/build/BUILD/openvdb-5.1.0 /builddir/build/BUILD/openvdb-5.1.0/openvdb/python /builddir/build/BUILD/openvdb-5.1.0 /builddir/build/BUILD/openvdb-5.1.0/openvdb/python /builddir/build/BUILD/openvdb-5.1.0/openvdb/python/CMakeFiles/pyopenvdb.dir/DependInfo.cmake --color=
Scanning dependencies of target pyopenvdb
make[2]: Leaving directory '/builddir/build/BUILD/openvdb-5.1.0'
/usr/bin/make -f openvdb/python/CMakeFiles/pyopenvdb.dir/build.make openvdb/python/CMakeFiles/pyopenvdb.dir/build
make[2]: Entering directory '/builddir/build/BUILD/openvdb-5.1.0'
[ 33%] Building CXX object openvdb/CMakeFiles/vdb_print.dir/cmd/openvdb_print/main.cc.o
cd /builddir/build/BUILD/openvdb-5.1.0/openvdb && /usr/bin/c++  -DOPENVDB_ABI_VERSION_NUMBER=3 -I/builddir/build/BUILD/openvdb-5.1.0 -I/builddir/build/BUILD/openvdb-5.1.0/openvdb/. -I/builddir/build/BUILD/openvdb-5.1.0/dwa -isystem /usr/include/OpenEXR  -O2 -g -pipe -Wall -Werror=format-security -Wp,-D_FORTIFY_SOURCE=2 -Wp,-D_GLIBCXX_ASSERTIONS -fexceptions -fstack-protector-strong -grecord-gcc-switches -specs=/usr/lib/rpm/redhat/redhat-hardened-cc1 -specs=/usr/lib/rpm/redhat/redhat-annobin-cc1 -fasynchronous-unwind-tables -fstack-clash-protection -Wl,--as-needed   -pthread -fPIC -std=gnu++11 -DOPENVDB_USE_BLOSC -DOPENVDB_USE_GLFW_3 -o CMakeFiles/vdb_print.dir/cmd/openvdb_print/main.cc.o -c /builddir/build/BUILD/openvdb-5.1.0/openvdb/cmd/openvdb_print/main.cc
make[2]: Leaving directory '/builddir/build/BUILD/openvdb-5.1.0'
make[2]: Entering directory '/builddir/build/BUILD/openvdb-5.1.0'
[ 40%] Linking CXX executable vdb_print
cd /builddir/build/BUILD/openvdb-5.1.0/openvdb && /usr/bin/cmake -E cmake_link_script CMakeFiles/vdb_print.dir/link.txt --verbose=1
/usr/bin/c++  -O2 -g -pipe -Wall -Werror=format-security -Wp,-D_FORTIFY_SOURCE=2 -Wp,-D_GLIBCXX_ASSERTIONS -fexceptions -fstack-protector-strong -grecord-gcc-switches -specs=/usr/lib/rpm/redhat/redhat-hardened-cc1 -specs=/usr/lib/rpm/redhat/redhat-annobin-cc1 -fasynchronous-unwind-tables -fstack-clash-protection -Wl,--as-needed  -Wl,-z,relro   -Wl,-z,now -specs=/usr/lib/rpm/redhat/redhat-hardened-ld -rdynamic CMakeFiles/vdb_print.dir/cmd/openvdb_print/main.cc.o  -o vdb_print -Wl,-rpath,/builddir/build/BUILD/openvdb-5.1.0/openvdb: libopenvdb.so.5.1.0 -lpthread -lblosc -lm -lstdc++ -lboost_iostreams -lboost_system -ltbb -lHalf -lz -lblosc 
make[2]: Leaving directory '/builddir/build/BUILD/openvdb-5.1.0'
make[1]: Entering directory '/builddir/build/BUILD/openvdb-5.1.0'
[ 40%] Built target vdb_print
make[1]: Leaving directory '/builddir/build/BUILD/openvdb-5.1.0'
make[2]: Entering directory '/builddir/build/BUILD/openvdb-5.1.0'
[ 36%] Building CXX object openvdb/CMakeFiles/vdb_test.dir/unittest/TestAttributeArray.cc.o
cd /builddir/build/BUILD/openvdb-5.1.0/openvdb && /usr/bin/c++  -DOPENVDB_ABI_VERSION_NUMBER=3 -I/builddir/build/BUILD/openvdb-5.1.0 -I/builddir/build/BUILD/openvdb-5.1.0/openvdb/. -I/builddir/build/BUILD/openvdb-5.1.0/dwa -isystem /usr/include/OpenEXR  -O2 -g -pipe -Wall -Werror=format-security -Wp,-D_FORTIFY_SOURCE=2 -Wp,-D_GLIBCXX_ASSERTIONS -fexceptions -fstack-protector-strong -grecord-gcc-switches -specs=/usr/lib/rpm/redhat/redhat-hardened-cc1 -specs=/usr/lib/rpm/redhat/redhat-annobin-cc1 -fasynchronous-unwind-tables -fstack-clash-protection -Wl,--as-needed   -pthread -fPIC -std=gnu++11 -DOPENVDB_USE_BLOSC -o CMakeFiles/vdb_test.dir/unittest/TestAttributeArray.cc.o -c /builddir/build/BUILD/openvdb-5.1.0/openvdb/unittest/TestAttributeArray.cc
make[2]: Leaving directory '/builddir/build/BUILD/openvdb-5.1.0'
BUILDSTDERR: In file included from /builddir/build/BUILD/openvdb-5.1.0/openvdb/unittest/TestAttributeArray.cc:32:
BUILDSTDERR: /builddir/build/BUILD/openvdb-5.1.0/openvdb/points/AttributeArray.h: In instantiation of 'openvdb::v5_1abi3::points::TypedAttributeArray<ValueType_, Codec_>::TypedAttributeArray(const openvdb::v5_1abi3::points::TypedAttributeArray<ValueType_, Codec_>&, bool) [with ValueType_ = openvdb::v5_1abi3::math::Mat4<double>; Codec_ = openvdb::v5_1abi3::points::NullCodec]':
BUILDSTDERR: /builddir/build/BUILD/openvdb-5.1.0/openvdb/points/AttributeArray.h:1010:32:   required from 'openvdb::v5_1abi3::points::AttributeArray::Ptr openvdb::v5_1abi3::points::TypedAttributeArray<ValueType_, Codec_>::copy() const [with ValueType_ = openvdb::v5_1abi3::math::Mat4<double>; Codec_ = openvdb::v5_1abi3::points::NullCodec; openvdb::v5_1abi3::points::AttributeArray::Ptr = std::shared_ptr<openvdb::v5_1abi3::points::AttributeArray>]'
BUILDSTDERR: /builddir/build/BUILD/openvdb-5.1.0/openvdb/points/AttributeArray.h:1008:1:   required from here
BUILDSTDERR: /builddir/build/BUILD/openvdb-5.1.0/openvdb/points/AttributeArray.h:905:20: warning: 'void* memcpy(void*, const void*, size_t)' writing to an object of type 'class openvdb::v5_1abi3::math::Mat4<double>' with no trivial copy-assignment; use copy-assignment or copy-initialization instead [-Wclass-memaccess]
BUILDSTDERR:          std::memcpy(mData.get(), rhs.mData.get(), this->arrayMemUsage());
BUILDSTDERR:          ~~~~~~~~~~~^~~~~~~~~~~~~~~~~~~~~~~~~~~~~~~~~~~~~~~~~~~~~~~~~~~~~
BUILDSTDERR: In file included from /builddir/build/BUILD/openvdb-5.1.0/openvdb/Types.h:44,
BUILDSTDERR:                  from /builddir/build/BUILD/openvdb-5.1.0/openvdb/points/AttributeArray.h:40,
BUILDSTDERR:                  from /builddir/build/BUILD/openvdb-5.1.0/openvdb/unittest/TestAttributeArray.cc:32:
BUILDSTDERR: /builddir/build/BUILD/openvdb-5.1.0/openvdb/math/Mat4.h:57:7: note: 'class openvdb::v5_1abi3::math::Mat4<double>' declared here
BUILDSTDERR:  class Mat4: public Mat<4, T>
BUILDSTDERR:        ^~~~
BUILDSTDERR: In file included from /builddir/build/BUILD/openvdb-5.1.0/openvdb/unittest/TestAttributeArray.cc:32:
BUILDSTDERR: /builddir/build/BUILD/openvdb-5.1.0/openvdb/points/AttributeArray.h: In instantiation of 'openvdb::v5_1abi3::points::TypedAttributeArray<ValueType_, Codec_>::TypedAttributeArray(const openvdb::v5_1abi3::points::TypedAttributeArray<ValueType_, Codec_>&, bool) [with ValueType_ = openvdb::v5_1abi3::math::Quat<double>; Codec_ = openvdb::v5_1abi3::points::NullCodec]':
BUILDSTDERR: /builddir/build/BUILD/openvdb-5.1.0/openvdb/points/AttributeArray.h:1010:32:   required from 'openvdb::v5_1abi3::points::AttributeArray::Ptr openvdb::v5_1abi3::points::TypedAttributeArray<ValueType_, Codec_>::copy() const [with ValueType_ = openvdb::v5_1abi3::math::Quat<double>; Codec_ = openvdb::v5_1abi3::points::NullCodec; openvdb::v5_1abi3::points::AttributeArray::Ptr = std::shared_ptr<openvdb::v5_1abi3::points::AttributeArray>]'
BUILDSTDERR: /builddir/build/BUILD/openvdb-5.1.0/openvdb/points/AttributeArray.h:1008:1:   required from here
BUILDSTDERR: /builddir/build/BUILD/openvdb-5.1.0/openvdb/points/AttributeArray.h:905:20: warning: 'void* memcpy(void*, const void*, size_t)' writing to an object of type 'class openvdb::v5_1abi3::math::Quat<double>' with no trivial copy-assignment; use copy-assignment or copy-initialization instead [-Wclass-memaccess]
BUILDSTDERR:          std::memcpy(mData.get(), rhs.mData.get(), this->arrayMemUsage());
BUILDSTDERR:          ~~~~~~~~~~~^~~~~~~~~~~~~~~~~~~~~~~~~~~~~~~~~~~~~~~~~~~~~~~~~~~~~
BUILDSTDERR: In file included from /builddir/build/BUILD/openvdb-5.1.0/openvdb/Types.h:39,
BUILDSTDERR:                  from /builddir/build/BUILD/openvdb-5.1.0/openvdb/points/AttributeArray.h:40,
BUILDSTDERR:                  from /builddir/build/BUILD/openvdb-5.1.0/openvdb/unittest/TestAttributeArray.cc:32:
BUILDSTDERR: /builddir/build/BUILD/openvdb-5.1.0/openvdb/math/Quat.h:105:7: note: 'class openvdb::v5_1abi3::math::Quat<double>' declared here
BUILDSTDERR:  class Quat
BUILDSTDERR:        ^~~~
BUILDSTDERR: In file included from /builddir/build/BUILD/openvdb-5.1.0/openvdb/unittest/TestAttributeArray.cc:32:
BUILDSTDERR: /builddir/build/BUILD/openvdb-5.1.0/openvdb/points/AttributeArray.h: In instantiation of 'openvdb::v5_1abi3::points::TypedAttributeArray<ValueType_, Codec_>::TypedAttributeArray(const openvdb::v5_1abi3::points::TypedAttributeArray<ValueType_, Codec_>&, bool) [with ValueType_ = openvdb::v5_1abi3::math::Quat<float>; Codec_ = openvdb::v5_1abi3::points::NullCodec]':
BUILDSTDERR: /builddir/build/BUILD/openvdb-5.1.0/openvdb/points/AttributeArray.h:1010:32:   required from 'openvdb::v5_1abi3::points::AttributeArray::Ptr openvdb::v5_1abi3::points::TypedAttributeArray<ValueType_, Codec_>::copy() const [with ValueType_ = openvdb::v5_1abi3::math::Quat<float>; Codec_ = openvdb::v5_1abi3::points::NullCodec; openvdb::v5_1abi3::points::AttributeArray::Ptr = std::shared_ptr<openvdb::v5_1abi3::points::AttributeArray>]'
BUILDSTDERR: /builddir/build/BUILD/openvdb-5.1.0/openvdb/points/AttributeArray.h:1008:1:   required from here
BUILDSTDERR: /builddir/build/BUILD/openvdb-5.1.0/openvdb/points/AttributeArray.h:905:20: warning: 'void* memcpy(void*, const void*, size_t)' writing to an object of type 'class openvdb::v5_1abi3::math::Quat<float>' with no trivial copy-assignment; use copy-assignment or copy-initialization instead [-Wclass-memaccess]
BUILDSTDERR:          std::memcpy(mData.get(), rhs.mData.get(), this->arrayMemUsage());
BUILDSTDERR:          ~~~~~~~~~~~^~~~~~~~~~~~~~~~~~~~~~~~~~~~~~~~~~~~~~~~~~~~~~~~~~~~~
BUILDSTDERR: In file included from /builddir/build/BUILD/openvdb-5.1.0/openvdb/Types.h:39,
BUILDSTDERR:                  from /builddir/build/BUILD/openvdb-5.1.0/openvdb/points/AttributeArray.h:40,
BUILDSTDERR:                  from /builddir/build/BUILD/openvdb-5.1.0/openvdb/unittest/TestAttributeArray.cc:32:
BUILDSTDERR: /builddir/build/BUILD/openvdb-5.1.0/openvdb/math/Quat.h:105:7: note: 'class openvdb::v5_1abi3::math::Quat<float>' declared here
BUILDSTDERR:  class Quat
BUILDSTDERR:        ^~~~
BUILDSTDERR: In file included from /builddir/build/BUILD/openvdb-5.1.0/openvdb/unittest/TestAttributeArray.cc:32:
BUILDSTDERR: /builddir/build/BUILD/openvdb-5.1.0/openvdb/points/AttributeArray.h: In instantiation of 'openvdb::v5_1abi3::points::TypedAttributeArray<ValueType_, Codec_>::TypedAttributeArray(const openvdb::v5_1abi3::points::TypedAttributeArray<ValueType_, Codec_>&, bool) [with ValueType_ = openvdb::v5_1abi3::math::Vec3<float>; Codec_ = openvdb::v5_1abi3::points::NullCodec]':
BUILDSTDERR: /builddir/build/BUILD/openvdb-5.1.0/openvdb/points/AttributeArray.h:1010:32:   required from 'openvdb::v5_1abi3::points::AttributeArray::Ptr openvdb::v5_1abi3::points::TypedAttributeArray<ValueType_, Codec_>::copy() const [with ValueType_ = openvdb::v5_1abi3::math::Vec3<float>; Codec_ = openvdb::v5_1abi3::points::NullCodec; openvdb::v5_1abi3::points::AttributeArray::Ptr = std::shared_ptr<openvdb::v5_1abi3::points::AttributeArray>]'
BUILDSTDERR: /builddir/build/BUILD/openvdb-5.1.0/openvdb/points/AttributeArray.h:1008:1:   required from here
BUILDSTDERR: /builddir/build/BUILD/openvdb-5.1.0/openvdb/points/AttributeArray.h:905:20: warning: 'void* memcpy(void*, const void*, size_t)' writing to an object of type 'class openvdb::v5_1abi3::math::Vec3<float>' with no trivial copy-assignment; use copy-assignment or copy-initialization instead [-Wclass-memaccess]
BUILDSTDERR:          std::memcpy(mData.get(), rhs.mData.get(), this->arrayMemUsage());
BUILDSTDERR:          ~~~~~~~~~~~^~~~~~~~~~~~~~~~~~~~~~~~~~~~~~~~~~~~~~~~~~~~~~~~~~~~~
BUILDSTDERR: In file included from /builddir/build/BUILD/openvdb-5.1.0/openvdb/math/BBox.h:35,
BUILDSTDERR:                  from /builddir/build/BUILD/openvdb-5.1.0/openvdb/Types.h:38,
BUILDSTDERR:                  from /builddir/build/BUILD/openvdb-5.1.0/openvdb/points/AttributeArray.h:40,
BUILDSTDERR:                  from /builddir/build/BUILD/openvdb-5.1.0/openvdb/unittest/TestAttributeArray.cc:32:
BUILDSTDERR: /builddir/build/BUILD/openvdb-5.1.0/openvdb/math/Vec3.h:50:7: note: 'class openvdb::v5_1abi3::math::Vec3<float>' declared here
BUILDSTDERR:  class Vec3: public Tuple<3, T>
BUILDSTDERR:        ^~~~
BUILDSTDERR: In file included from /builddir/build/BUILD/openvdb-5.1.0/openvdb/unittest/TestAttributeArray.cc:32:
BUILDSTDERR: /builddir/build/BUILD/openvdb-5.1.0/openvdb/points/AttributeArray.h: In instantiation of 'openvdb::v5_1abi3::points::TypedAttributeArray<ValueType_, Codec_>::TypedAttributeArray(const openvdb::v5_1abi3::points::TypedAttributeArray<ValueType_, Codec_>&, bool) [with ValueType_ = float; Codec_ = openvdb::v5_1abi3::points::TruncateCodec]':
BUILDSTDERR: /builddir/build/BUILD/openvdb-5.1.0/openvdb/points/AttributeArray.h:1010:32:   required from 'openvdb::v5_1abi3::points::AttributeArray::Ptr openvdb::v5_1abi3::points::TypedAttributeArray<ValueType_, Codec_>::copy() const [with ValueType_ = float; Codec_ = openvdb::v5_1abi3::points::TruncateCodec; openvdb::v5_1abi3::points::AttributeArray::Ptr = std::shared_ptr<openvdb::v5_1abi3::points::AttributeArray>]'
BUILDSTDERR: /builddir/build/BUILD/openvdb-5.1.0/openvdb/points/AttributeArray.h:1008:1:   required from here
BUILDSTDERR: /builddir/build/BUILD/openvdb-5.1.0/openvdb/points/AttributeArray.h:905:20: warning: 'void* memcpy(void*, const void*, size_t)' writing to an object of type 'class half' with no trivial copy-assignment; use copy-assignment or copy-initialization instead [-Wclass-memaccess]
BUILDSTDERR:          std::memcpy(mData.get(), rhs.mData.get(), this->arrayMemUsage());
BUILDSTDERR:          ~~~~~~~~~~~^~~~~~~~~~~~~~~~~~~~~~~~~~~~~~~~~~~~~~~~~~~~~~~~~~~~~
BUILDSTDERR: In file included from /builddir/build/BUILD/openvdb-5.1.0/openvdb/Types.h:36,
BUILDSTDERR:                  from /builddir/build/BUILD/openvdb-5.1.0/openvdb/points/AttributeArray.h:40,
BUILDSTDERR:                  from /builddir/build/BUILD/openvdb-5.1.0/openvdb/unittest/TestAttributeArray.cc:32:
BUILDSTDERR: /usr/include/OpenEXR/half.h:91:7: note: 'class half' declared here
BUILDSTDERR:  class half
BUILDSTDERR:        ^~~~
make[2]: Entering directory '/builddir/build/BUILD/openvdb-5.1.0'
[ 41%] Building CXX object openvdb/CMakeFiles/vdb_test.dir/unittest/TestAttributeArrayString.cc.o
cd /builddir/build/BUILD/openvdb-5.1.0/openvdb && /usr/bin/c++  -DOPENVDB_ABI_VERSION_NUMBER=3 -I/builddir/build/BUILD/openvdb-5.1.0 -I/builddir/build/BUILD/openvdb-5.1.0/openvdb/. -I/builddir/build/BUILD/openvdb-5.1.0/dwa -isystem /usr/include/OpenEXR  -O2 -g -pipe -Wall -Werror=format-security -Wp,-D_FORTIFY_SOURCE=2 -Wp,-D_GLIBCXX_ASSERTIONS -fexceptions -fstack-protector-strong -grecord-gcc-switches -specs=/usr/lib/rpm/redhat/redhat-hardened-cc1 -specs=/usr/lib/rpm/redhat/redhat-annobin-cc1 -fasynchronous-unwind-tables -fstack-clash-protection -Wl,--as-needed   -pthread -fPIC -std=gnu++11 -DOPENVDB_USE_BLOSC -o CMakeFiles/vdb_test.dir/unittest/TestAttributeArrayString.cc.o -c /builddir/build/BUILD/openvdb-5.1.0/openvdb/unittest/TestAttributeArrayString.cc
make[2]: Leaving directory '/builddir/build/BUILD/openvdb-5.1.0'
make[2]: Entering directory '/builddir/build/BUILD/openvdb-5.1.0'
[ 40%] Building CXX object openvdb/python/CMakeFiles/pyopenvdb.dir/pyFloatGrid.cc.o
cd /builddir/build/BUILD/openvdb-5.1.0/openvdb/python && /usr/bin/c++  -DOPENVDB_ABI_VERSION_NUMBER=3 -Dpyopenvdb_EXPORTS -I/builddir/build/BUILD/openvdb-5.1.0 -isystem /usr/include/OpenEXR -isystem /usr/include/python3.7m  -O2 -g -pipe -Wall -Werror=format-security -Wp,-D_FORTIFY_SOURCE=2 -Wp,-D_GLIBCXX_ASSERTIONS -fexceptions -fstack-protector-strong -grecord-gcc-switches -specs=/usr/lib/rpm/redhat/redhat-hardened-cc1 -specs=/usr/lib/rpm/redhat/redhat-annobin-cc1 -fasynchronous-unwind-tables -fstack-clash-protection -Wl,--as-needed -fPIC   -DOPENVDB_PRIVATE -DOPENVDB_USE_BLOSC  -o CMakeFiles/pyopenvdb.dir/pyFloatGrid.cc.o -c /builddir/build/BUILD/openvdb-5.1.0/openvdb/python/pyFloatGrid.cc
make[2]: Leaving directory '/builddir/build/BUILD/openvdb-5.1.0'
make[2]: Entering directory '/builddir/build/BUILD/openvdb-5.1.0'
[ 38%] Building CXX object openvdb/CMakeFiles/vdb_view.dir/viewer/RenderModules.cc.o
cd /builddir/build/BUILD/openvdb-5.1.0/openvdb && /usr/bin/c++  -DOPENVDB_ABI_VERSION_NUMBER=3 -I/builddir/build/BUILD/openvdb-5.1.0 -I/builddir/build/BUILD/openvdb-5.1.0/openvdb/. -I/builddir/build/BUILD/openvdb-5.1.0/dwa -isystem /usr/include/OpenEXR  -O2 -g -pipe -Wall -Werror=format-security -Wp,-D_FORTIFY_SOURCE=2 -Wp,-D_GLIBCXX_ASSERTIONS -fexceptions -fstack-protector-strong -grecord-gcc-switches -specs=/usr/lib/rpm/redhat/redhat-hardened-cc1 -specs=/usr/lib/rpm/redhat/redhat-annobin-cc1 -fasynchronous-unwind-tables -fstack-clash-protection -Wl,--as-needed   -pthread -fPIC -std=gnu++11 -DOPENVDB_USE_BLOSC -DOPENVDB_USE_GLFW_3 -DGL_GLEXT_PROTOTYPES=1 -o CMakeFiles/vdb_view.dir/viewer/RenderModules.cc.o -c /builddir/build/BUILD/openvdb-5.1.0/openvdb/viewer/RenderModules.cc
make[2]: Leaving directory '/builddir/build/BUILD/openvdb-5.1.0'
make[2]: Entering directory '/builddir/build/BUILD/openvdb-5.1.0'
[ 44%] Linking CXX executable vdb_view
cd /builddir/build/BUILD/openvdb-5.1.0/openvdb && /usr/bin/cmake -E cmake_link_script CMakeFiles/vdb_view.dir/link.txt --verbose=1
/usr/bin/c++  -O2 -g -pipe -Wall -Werror=format-security -Wp,-D_FORTIFY_SOURCE=2 -Wp,-D_GLIBCXX_ASSERTIONS -fexceptions -fstack-protector-strong -grecord-gcc-switches -specs=/usr/lib/rpm/redhat/redhat-hardened-cc1 -specs=/usr/lib/rpm/redhat/redhat-annobin-cc1 -fasynchronous-unwind-tables -fstack-clash-protection -Wl,--as-needed  -Wl,-z,relro   -Wl,-z,now -specs=/usr/lib/rpm/redhat/redhat-hardened-ld -rdynamic CMakeFiles/vdb_view.dir/cmd/openvdb_view/main.cc.o CMakeFiles/vdb_view.dir/viewer/Camera.cc.o CMakeFiles/vdb_view.dir/viewer/ClipBox.cc.o CMakeFiles/vdb_view.dir/viewer/Font.cc.o CMakeFiles/vdb_view.dir/viewer/RenderModules.cc.o CMakeFiles/vdb_view.dir/viewer/Viewer.cc.o  -o vdb_view -Wl,-rpath,/builddir/build/BUILD/openvdb-5.1.0/openvdb: libopenvdb.so.5.1.0 -lboost_thread -lGL -lGLU -lglfw -lX11 -lXi -lXrandr -lXinerama -lXcursor -lXxf86vm -lm -lstdc++ -lboost_iostreams -lboost_system -ltbb -lHalf -lz -lblosc 
make[2]: Leaving directory '/builddir/build/BUILD/openvdb-5.1.0'
BUILDSTDERR: /usr/bin/ld: CMakeFiles/vdb_view.dir/viewer/Viewer.cc.o: undefined reference to symbol '__atomic_compare_exchange_1@@LIBATOMIC_1.0'
BUILDSTDERR: /usr/bin/ld: //usr/lib64/libatomic.so.1: error adding symbols: DSO missing from command line
BUILDSTDERR: collect2: error: ld returned 1 exit status
BUILDSTDERR: make[2]: *** [openvdb/CMakeFiles/vdb_view.dir/build.make:173: openvdb/vdb_view] Error 1
BUILDSTDERR: make[1]: *** [CMakeFiles/Makefile2:252: openvdb/CMakeFiles/vdb_view.dir/all] Error 2
BUILDSTDERR: make[1]: *** Waiting for unfinished jobs....
make[2]: Entering directory '/builddir/build/BUILD/openvdb-5.1.0'
[ 42%] Building CXX object openvdb/CMakeFiles/vdb_test.dir/unittest/TestAttributeGroup.cc.o
cd /builddir/build/BUILD/openvdb-5.1.0/openvdb && /usr/bin/c++  -DOPENVDB_ABI_VERSION_NUMBER=3 -I/builddir/build/BUILD/openvdb-5.1.0 -I/builddir/build/BUILD/openvdb-5.1.0/openvdb/. -I/builddir/build/BUILD/openvdb-5.1.0/dwa -isystem /usr/include/OpenEXR  -O2 -g -pipe -Wall -Werror=format-security -Wp,-D_FORTIFY_SOURCE=2 -Wp,-D_GLIBCXX_ASSERTIONS -fexceptions -fstack-protector-strong -grecord-gcc-switches -specs=/usr/lib/rpm/redhat/redhat-hardened-cc1 -specs=/usr/lib/rpm/redhat/redhat-annobin-cc1 -fasynchronous-unwind-tables -fstack-clash-protection -Wl,--as-needed   -pthread -fPIC -std=gnu++11 -DOPENVDB_USE_BLOSC -o CMakeFiles/vdb_test.dir/unittest/TestAttributeGroup.cc.o -c /builddir/build/BUILD/openvdb-5.1.0/openvdb/unittest/TestAttributeGroup.cc
make[2]: Leaving directory '/builddir/build/BUILD/openvdb-5.1.0'
make[2]: Entering directory '/builddir/build/BUILD/openvdb-5.1.0'
[ 44%] Building CXX object openvdb/CMakeFiles/vdb_test.dir/unittest/TestBBox.cc.o
cd /builddir/build/BUILD/openvdb-5.1.0/openvdb && /usr/bin/c++  -DOPENVDB_ABI_VERSION_NUMBER=3 -I/builddir/build/BUILD/openvdb-5.1.0 -I/builddir/build/BUILD/openvdb-5.1.0/openvdb/. -I/builddir/build/BUILD/openvdb-5.1.0/dwa -isystem /usr/include/OpenEXR  -O2 -g -pipe -Wall -Werror=format-security -Wp,-D_FORTIFY_SOURCE=2 -Wp,-D_GLIBCXX_ASSERTIONS -fexceptions -fstack-protector-strong -grecord-gcc-switches -specs=/usr/lib/rpm/redhat/redhat-hardened-cc1 -specs=/usr/lib/rpm/redhat/redhat-annobin-cc1 -fasynchronous-unwind-tables -fstack-clash-protection -Wl,--as-needed   -pthread -fPIC -std=gnu++11 -DOPENVDB_USE_BLOSC -o CMakeFiles/vdb_test.dir/unittest/TestBBox.cc.o -c /builddir/build/BUILD/openvdb-5.1.0/openvdb/unittest/TestBBox.cc
make[2]: Leaving directory '/builddir/build/BUILD/openvdb-5.1.0'
make[2]: Entering directory '/builddir/build/BUILD/openvdb-5.1.0'
[ 43%] Building CXX object openvdb/CMakeFiles/vdb_test.dir/unittest/TestAttributeSet.cc.o
cd /builddir/build/BUILD/openvdb-5.1.0/openvdb && /usr/bin/c++  -DOPENVDB_ABI_VERSION_NUMBER=3 -I/builddir/build/BUILD/openvdb-5.1.0 -I/builddir/build/BUILD/openvdb-5.1.0/openvdb/. -I/builddir/build/BUILD/openvdb-5.1.0/dwa -isystem /usr/include/OpenEXR  -O2 -g -pipe -Wall -Werror=format-security -Wp,-D_FORTIFY_SOURCE=2 -Wp,-D_GLIBCXX_ASSERTIONS -fexceptions -fstack-protector-strong -grecord-gcc-switches -specs=/usr/lib/rpm/redhat/redhat-hardened-cc1 -specs=/usr/lib/rpm/redhat/redhat-annobin-cc1 -fasynchronous-unwind-tables -fstack-clash-protection -Wl,--as-needed   -pthread -fPIC -std=gnu++11 -DOPENVDB_USE_BLOSC -o CMakeFiles/vdb_test.dir/unittest/TestAttributeSet.cc.o -c /builddir/build/BUILD/openvdb-5.1.0/openvdb/unittest/TestAttributeSet.cc
make[2]: Leaving directory '/builddir/build/BUILD/openvdb-5.1.0'
make[2]: Entering directory '/builddir/build/BUILD/openvdb-5.1.0'
[ 44%] Building CXX object openvdb/python/CMakeFiles/pyopenvdb.dir/pyMetadata.cc.o
cd /builddir/build/BUILD/openvdb-5.1.0/openvdb/python && /usr/bin/c++  -DOPENVDB_ABI_VERSION_NUMBER=3 -Dpyopenvdb_EXPORTS -I/builddir/build/BUILD/openvdb-5.1.0 -isystem /usr/include/OpenEXR -isystem /usr/include/python3.7m  -O2 -g -pipe -Wall -Werror=format-security -Wp,-D_FORTIFY_SOURCE=2 -Wp,-D_GLIBCXX_ASSERTIONS -fexceptions -fstack-protector-strong -grecord-gcc-switches -specs=/usr/lib/rpm/redhat/redhat-hardened-cc1 -specs=/usr/lib/rpm/redhat/redhat-annobin-cc1 -fasynchronous-unwind-tables -fstack-clash-protection -Wl,--as-needed -fPIC   -DOPENVDB_PRIVATE -DOPENVDB_USE_BLOSC  -o CMakeFiles/pyopenvdb.dir/pyMetadata.cc.o -c /builddir/build/BUILD/openvdb-5.1.0/openvdb/python/pyMetadata.cc
make[2]: Leaving directory '/builddir/build/BUILD/openvdb-5.1.0'
make[2]: Entering directory '/builddir/build/BUILD/openvdb-5.1.0'
[ 47%] Building CXX object openvdb/CMakeFiles/vdb_test.dir/unittest/TestCoord.cc.o
cd /builddir/build/BUILD/openvdb-5.1.0/openvdb && /usr/bin/c++  -DOPENVDB_ABI_VERSION_NUMBER=3 -I/builddir/build/BUILD/openvdb-5.1.0 -I/builddir/build/BUILD/openvdb-5.1.0/openvdb/. -I/builddir/build/BUILD/openvdb-5.1.0/dwa -isystem /usr/include/OpenEXR  -O2 -g -pipe -Wall -Werror=format-security -Wp,-D_FORTIFY_SOURCE=2 -Wp,-D_GLIBCXX_ASSERTIONS -fexceptions -fstack-protector-strong -grecord-gcc-switches -specs=/usr/lib/rpm/redhat/redhat-hardened-cc1 -specs=/usr/lib/rpm/redhat/redhat-annobin-cc1 -fasynchronous-unwind-tables -fstack-clash-protection -Wl,--as-needed   -pthread -fPIC -std=gnu++11 -DOPENVDB_USE_BLOSC -o CMakeFiles/vdb_test.dir/unittest/TestCoord.cc.o -c /builddir/build/BUILD/openvdb-5.1.0/openvdb/unittest/TestCoord.cc
make[2]: Leaving directory '/builddir/build/BUILD/openvdb-5.1.0'
make[2]: Entering directory '/builddir/build/BUILD/openvdb-5.1.0'
[ 46%] Building CXX object openvdb/CMakeFiles/vdb_test.dir/unittest/TestConjGradient.cc.o
cd /builddir/build/BUILD/openvdb-5.1.0/openvdb && /usr/bin/c++  -DOPENVDB_ABI_VERSION_NUMBER=3 -I/builddir/build/BUILD/openvdb-5.1.0 -I/builddir/build/BUILD/openvdb-5.1.0/openvdb/. -I/builddir/build/BUILD/openvdb-5.1.0/dwa -isystem /usr/include/OpenEXR  -O2 -g -pipe -Wall -Werror=format-security -Wp,-D_FORTIFY_SOURCE=2 -Wp,-D_GLIBCXX_ASSERTIONS -fexceptions -fstack-protector-strong -grecord-gcc-switches -specs=/usr/lib/rpm/redhat/redhat-hardened-cc1 -specs=/usr/lib/rpm/redhat/redhat-annobin-cc1 -fasynchronous-unwind-tables -fstack-clash-protection -Wl,--as-needed   -pthread -fPIC -std=gnu++11 -DOPENVDB_USE_BLOSC -o CMakeFiles/vdb_test.dir/unittest/TestConjGradient.cc.o -c /builddir/build/BUILD/openvdb-5.1.0/openvdb/unittest/TestConjGradient.cc
make[2]: Leaving directory '/builddir/build/BUILD/openvdb-5.1.0'
make[2]: Entering directory '/builddir/build/BUILD/openvdb-5.1.0'
[ 45%] Building CXX object openvdb/python/CMakeFiles/pyopenvdb.dir/pyOpenVDBModule.cc.o
cd /builddir/build/BUILD/openvdb-5.1.0/openvdb/python && /usr/bin/c++  -DOPENVDB_ABI_VERSION_NUMBER=3 -Dpyopenvdb_EXPORTS -I/builddir/build/BUILD/openvdb-5.1.0 -isystem /usr/include/OpenEXR -isystem /usr/include/python3.7m  -O2 -g -pipe -Wall -Werror=format-security -Wp,-D_FORTIFY_SOURCE=2 -Wp,-D_GLIBCXX_ASSERTIONS -fexceptions -fstack-protector-strong -grecord-gcc-switches -specs=/usr/lib/rpm/redhat/redhat-hardened-cc1 -specs=/usr/lib/rpm/redhat/redhat-annobin-cc1 -fasynchronous-unwind-tables -fstack-clash-protection -Wl,--as-needed -fPIC   -DOPENVDB_PRIVATE -DOPENVDB_USE_BLOSC  -o CMakeFiles/pyopenvdb.dir/pyOpenVDBModule.cc.o -c /builddir/build/BUILD/openvdb-5.1.0/openvdb/python/pyOpenVDBModule.cc
make[2]: Leaving directory '/builddir/build/BUILD/openvdb-5.1.0'
make[2]: Entering directory '/builddir/build/BUILD/openvdb-5.1.0'
[ 49%] Building CXX object openvdb/CMakeFiles/vdb_test.dir/unittest/TestCurl.cc.o
cd /builddir/build/BUILD/openvdb-5.1.0/openvdb && /usr/bin/c++  -DOPENVDB_ABI_VERSION_NUMBER=3 -I/builddir/build/BUILD/openvdb-5.1.0 -I/builddir/build/BUILD/openvdb-5.1.0/openvdb/. -I/builddir/build/BUILD/openvdb-5.1.0/dwa -isystem /usr/include/OpenEXR  -O2 -g -pipe -Wall -Werror=format-security -Wp,-D_FORTIFY_SOURCE=2 -Wp,-D_GLIBCXX_ASSERTIONS -fexceptions -fstack-protector-strong -grecord-gcc-switches -specs=/usr/lib/rpm/redhat/redhat-hardened-cc1 -specs=/usr/lib/rpm/redhat/redhat-annobin-cc1 -fasynchronous-unwind-tables -fstack-clash-protection -Wl,--as-needed   -pthread -fPIC -std=gnu++11 -DOPENVDB_USE_BLOSC -o CMakeFiles/vdb_test.dir/unittest/TestCurl.cc.o -c /builddir/build/BUILD/openvdb-5.1.0/openvdb/unittest/TestCurl.cc
make[2]: Leaving directory '/builddir/build/BUILD/openvdb-5.1.0'
make[2]: Entering directory '/builddir/build/BUILD/openvdb-5.1.0'
[ 42%] Building CXX object openvdb/python/CMakeFiles/pyopenvdb.dir/pyIntGrid.cc.o
cd /builddir/build/BUILD/openvdb-5.1.0/openvdb/python && /usr/bin/c++  -DOPENVDB_ABI_VERSION_NUMBER=3 -Dpyopenvdb_EXPORTS -I/builddir/build/BUILD/openvdb-5.1.0 -isystem /usr/include/OpenEXR -isystem /usr/include/python3.7m  -O2 -g -pipe -Wall -Werror=format-security -Wp,-D_FORTIFY_SOURCE=2 -Wp,-D_GLIBCXX_ASSERTIONS -fexceptions -fstack-protector-strong -grecord-gcc-switches -specs=/usr/lib/rpm/redhat/redhat-hardened-cc1 -specs=/usr/lib/rpm/redhat/redhat-annobin-cc1 -fasynchronous-unwind-tables -fstack-clash-protection -Wl,--as-needed -fPIC   -DOPENVDB_PRIVATE -DOPENVDB_USE_BLOSC  -o CMakeFiles/pyopenvdb.dir/pyIntGrid.cc.o -c /builddir/build/BUILD/openvdb-5.1.0/openvdb/python/pyIntGrid.cc
make[2]: Leaving directory '/builddir/build/BUILD/openvdb-5.1.0'
make[2]: Entering directory '/builddir/build/BUILD/openvdb-5.1.0'
[ 48%] Building CXX object openvdb/python/CMakeFiles/pyopenvdb.dir/pyTransform.cc.o
cd /builddir/build/BUILD/openvdb-5.1.0/openvdb/python && /usr/bin/c++  -DOPENVDB_ABI_VERSION_NUMBER=3 -Dpyopenvdb_EXPORTS -I/builddir/build/BUILD/openvdb-5.1.0 -isystem /usr/include/OpenEXR -isystem /usr/include/python3.7m  -O2 -g -pipe -Wall -Werror=format-security -Wp,-D_FORTIFY_SOURCE=2 -Wp,-D_GLIBCXX_ASSERTIONS -fexceptions -fstack-protector-strong -grecord-gcc-switches -specs=/usr/lib/rpm/redhat/redhat-hardened-cc1 -specs=/usr/lib/rpm/redhat/redhat-annobin-cc1 -fasynchronous-unwind-tables -fstack-clash-protection -Wl,--as-needed -fPIC   -DOPENVDB_PRIVATE -DOPENVDB_USE_BLOSC  -o CMakeFiles/pyopenvdb.dir/pyTransform.cc.o -c /builddir/build/BUILD/openvdb-5.1.0/openvdb/python/pyTransform.cc
make[2]: Leaving directory '/builddir/build/BUILD/openvdb-5.1.0'
make[2]: Entering directory '/builddir/build/BUILD/openvdb-5.1.0'
[ 48%] Building CXX object openvdb/CMakeFiles/vdb_test.dir/unittest/TestCpt.cc.o
cd /builddir/build/BUILD/openvdb-5.1.0/openvdb && /usr/bin/c++  -DOPENVDB_ABI_VERSION_NUMBER=3 -I/builddir/build/BUILD/openvdb-5.1.0 -I/builddir/build/BUILD/openvdb-5.1.0/openvdb/. -I/builddir/build/BUILD/openvdb-5.1.0/dwa -isystem /usr/include/OpenEXR  -O2 -g -pipe -Wall -Werror=format-security -Wp,-D_FORTIFY_SOURCE=2 -Wp,-D_GLIBCXX_ASSERTIONS -fexceptions -fstack-protector-strong -grecord-gcc-switches -specs=/usr/lib/rpm/redhat/redhat-hardened-cc1 -specs=/usr/lib/rpm/redhat/redhat-annobin-cc1 -fasynchronous-unwind-tables -fstack-clash-protection -Wl,--as-needed   -pthread -fPIC -std=gnu++11 -DOPENVDB_USE_BLOSC -o CMakeFiles/vdb_test.dir/unittest/TestCpt.cc.o -c /builddir/build/BUILD/openvdb-5.1.0/openvdb/unittest/TestCpt.cc
make[2]: Leaving directory '/builddir/build/BUILD/openvdb-5.1.0'
make[2]: Entering directory '/builddir/build/BUILD/openvdb-5.1.0'
[ 50%] Building CXX object openvdb/CMakeFiles/vdb_test.dir/unittest/TestDenseSparseTools.cc.o
cd /builddir/build/BUILD/openvdb-5.1.0/openvdb && /usr/bin/c++  -DOPENVDB_ABI_VERSION_NUMBER=3 -I/builddir/build/BUILD/openvdb-5.1.0 -I/builddir/build/BUILD/openvdb-5.1.0/openvdb/. -I/builddir/build/BUILD/openvdb-5.1.0/dwa -isystem /usr/include/OpenEXR  -O2 -g -pipe -Wall -Werror=format-security -Wp,-D_FORTIFY_SOURCE=2 -Wp,-D_GLIBCXX_ASSERTIONS -fexceptions -fstack-protector-strong -grecord-gcc-switches -specs=/usr/lib/rpm/redhat/redhat-hardened-cc1 -specs=/usr/lib/rpm/redhat/redhat-annobin-cc1 -fasynchronous-unwind-tables -fstack-clash-protection -Wl,--as-needed   -pthread -fPIC -std=gnu++11 -DOPENVDB_USE_BLOSC -o CMakeFiles/vdb_test.dir/unittest/TestDenseSparseTools.cc.o -c /builddir/build/BUILD/openvdb-5.1.0/openvdb/unittest/TestDenseSparseTools.cc
make[2]: Leaving directory '/builddir/build/BUILD/openvdb-5.1.0'
make[2]: Entering directory '/builddir/build/BUILD/openvdb-5.1.0'
[ 50%] Building CXX object openvdb/CMakeFiles/vdb_test.dir/unittest/TestDense.cc.o
cd /builddir/build/BUILD/openvdb-5.1.0/openvdb && /usr/bin/c++  -DOPENVDB_ABI_VERSION_NUMBER=3 -I/builddir/build/BUILD/openvdb-5.1.0 -I/builddir/build/BUILD/openvdb-5.1.0/openvdb/. -I/builddir/build/BUILD/openvdb-5.1.0/dwa -isystem /usr/include/OpenEXR  -O2 -g -pipe -Wall -Werror=format-security -Wp,-D_FORTIFY_SOURCE=2 -Wp,-D_GLIBCXX_ASSERTIONS -fexceptions -fstack-protector-strong -grecord-gcc-switches -specs=/usr/lib/rpm/redhat/redhat-hardened-cc1 -specs=/usr/lib/rpm/redhat/redhat-annobin-cc1 -fasynchronous-unwind-tables -fstack-clash-protection -Wl,--as-needed   -pthread -fPIC -std=gnu++11 -DOPENVDB_USE_BLOSC -o CMakeFiles/vdb_test.dir/unittest/TestDense.cc.o -c /builddir/build/BUILD/openvdb-5.1.0/openvdb/unittest/TestDense.cc
make[2]: Leaving directory '/builddir/build/BUILD/openvdb-5.1.0'
make[2]: Entering directory '/builddir/build/BUILD/openvdb-5.1.0'
[ 52%] Building CXX object openvdb/CMakeFiles/vdb_test.dir/unittest/TestDoubleMetadata.cc.o
cd /builddir/build/BUILD/openvdb-5.1.0/openvdb && /usr/bin/c++  -DOPENVDB_ABI_VERSION_NUMBER=3 -I/builddir/build/BUILD/openvdb-5.1.0 -I/builddir/build/BUILD/openvdb-5.1.0/openvdb/. -I/builddir/build/BUILD/openvdb-5.1.0/dwa -isystem /usr/include/OpenEXR  -O2 -g -pipe -Wall -Werror=format-security -Wp,-D_FORTIFY_SOURCE=2 -Wp,-D_GLIBCXX_ASSERTIONS -fexceptions -fstack-protector-strong -grecord-gcc-switches -specs=/usr/lib/rpm/redhat/redhat-hardened-cc1 -specs=/usr/lib/rpm/redhat/redhat-annobin-cc1 -fasynchronous-unwind-tables -fstack-clash-protection -Wl,--as-needed   -pthread -fPIC -std=gnu++11 -DOPENVDB_USE_BLOSC -o CMakeFiles/vdb_test.dir/unittest/TestDoubleMetadata.cc.o -c /builddir/build/BUILD/openvdb-5.1.0/openvdb/unittest/TestDoubleMetadata.cc
make[2]: Leaving directory '/builddir/build/BUILD/openvdb-5.1.0'
make[2]: Entering directory '/builddir/build/BUILD/openvdb-5.1.0'
[ 53%] Building CXX object openvdb/CMakeFiles/vdb_test.dir/unittest/TestExceptions.cc.o
cd /builddir/build/BUILD/openvdb-5.1.0/openvdb && /usr/bin/c++  -DOPENVDB_ABI_VERSION_NUMBER=3 -I/builddir/build/BUILD/openvdb-5.1.0 -I/builddir/build/BUILD/openvdb-5.1.0/openvdb/. -I/builddir/build/BUILD/openvdb-5.1.0/dwa -isystem /usr/include/OpenEXR  -O2 -g -pipe -Wall -Werror=format-security -Wp,-D_FORTIFY_SOURCE=2 -Wp,-D_GLIBCXX_ASSERTIONS -fexceptions -fstack-protector-strong -grecord-gcc-switches -specs=/usr/lib/rpm/redhat/redhat-hardened-cc1 -specs=/usr/lib/rpm/redhat/redhat-annobin-cc1 -fasynchronous-unwind-tables -fstack-clash-protection -Wl,--as-needed   -pthread -fPIC -std=gnu++11 -DOPENVDB_USE_BLOSC -o CMakeFiles/vdb_test.dir/unittest/TestExceptions.cc.o -c /builddir/build/BUILD/openvdb-5.1.0/openvdb/unittest/TestExceptions.cc
make[2]: Leaving directory '/builddir/build/BUILD/openvdb-5.1.0'
make[2]: Entering directory '/builddir/build/BUILD/openvdb-5.1.0'
[ 54%] Building CXX object openvdb/CMakeFiles/vdb_test.dir/unittest/TestFile.cc.o
cd /builddir/build/BUILD/openvdb-5.1.0/openvdb && /usr/bin/c++  -DOPENVDB_ABI_VERSION_NUMBER=3 -I/builddir/build/BUILD/openvdb-5.1.0 -I/builddir/build/BUILD/openvdb-5.1.0/openvdb/. -I/builddir/build/BUILD/openvdb-5.1.0/dwa -isystem /usr/include/OpenEXR  -O2 -g -pipe -Wall -Werror=format-security -Wp,-D_FORTIFY_SOURCE=2 -Wp,-D_GLIBCXX_ASSERTIONS -fexceptions -fstack-protector-strong -grecord-gcc-switches -specs=/usr/lib/rpm/redhat/redhat-hardened-cc1 -specs=/usr/lib/rpm/redhat/redhat-annobin-cc1 -fasynchronous-unwind-tables -fstack-clash-protection -Wl,--as-needed   -pthread -fPIC -std=gnu++11 -DOPENVDB_USE_BLOSC -o CMakeFiles/vdb_test.dir/unittest/TestFile.cc.o -c /builddir/build/BUILD/openvdb-5.1.0/openvdb/unittest/TestFile.cc
make[2]: Leaving directory '/builddir/build/BUILD/openvdb-5.1.0'
BUILDSTDERR: /builddir/build/BUILD/openvdb-5.1.0/openvdb/unittest/TestFile.cc: In member function 'void TestFile::testBlosc()':
BUILDSTDERR: /builddir/build/BUILD/openvdb-5.1.0/openvdb/unittest/TestFile.cc:2555:54: error: invalid conversion from 'char**' to 'const char**' [-fpermissive]
BUILDSTDERR:          if (0 > blosc_compcode_to_compname(compcode, &compname)) continue;
BUILDSTDERR:                                                       ^~~~~~~~~
BUILDSTDERR: In file included from /builddir/build/BUILD/openvdb-5.1.0/openvdb/unittest/TestFile.cc:62:
BUILDSTDERR: /usr/include/blosc.h:348:72: note:   initializing argument 2 of 'int blosc_compcode_to_compname(int, const char**)'
BUILDSTDERR:  BLOSC_EXPORT int blosc_compcode_to_compname(int compcode, const char **compname);
BUILDSTDERR:                                                            ~~~~~~~~~~~~~^~~~~~~~
BUILDSTDERR: make[2]: *** [openvdb/CMakeFiles/vdb_test.dir/build.make:274: openvdb/CMakeFiles/vdb_test.dir/unittest/TestFile.cc.o] Error 1
BUILDSTDERR: make[2]: *** Waiting for unfinished jobs....
make[2]: Entering directory '/builddir/build/BUILD/openvdb-5.1.0'
[ 51%] Building CXX object openvdb/CMakeFiles/vdb_test.dir/unittest/TestDiagnostics.cc.o
cd /builddir/build/BUILD/openvdb-5.1.0/openvdb && /usr/bin/c++  -DOPENVDB_ABI_VERSION_NUMBER=3 -I/builddir/build/BUILD/openvdb-5.1.0 -I/builddir/build/BUILD/openvdb-5.1.0/openvdb/. -I/builddir/build/BUILD/openvdb-5.1.0/dwa -isystem /usr/include/OpenEXR  -O2 -g -pipe -Wall -Werror=format-security -Wp,-D_FORTIFY_SOURCE=2 -Wp,-D_GLIBCXX_ASSERTIONS -fexceptions -fstack-protector-strong -grecord-gcc-switches -specs=/usr/lib/rpm/redhat/redhat-hardened-cc1 -specs=/usr/lib/rpm/redhat/redhat-annobin-cc1 -fasynchronous-unwind-tables -fstack-clash-protection -Wl,--as-needed   -pthread -fPIC -std=gnu++11 -DOPENVDB_USE_BLOSC -o CMakeFiles/vdb_test.dir/unittest/TestDiagnostics.cc.o -c /builddir/build/BUILD/openvdb-5.1.0/openvdb/unittest/TestDiagnostics.cc
make[2]: Leaving directory '/builddir/build/BUILD/openvdb-5.1.0'
make[2]: Entering directory '/builddir/build/BUILD/openvdb-5.1.0'
[ 49%] Building CXX object openvdb/python/CMakeFiles/pyopenvdb.dir/pyVec3Grid.cc.o
cd /builddir/build/BUILD/openvdb-5.1.0/openvdb/python && /usr/bin/c++  -DOPENVDB_ABI_VERSION_NUMBER=3 -Dpyopenvdb_EXPORTS -I/builddir/build/BUILD/openvdb-5.1.0 -isystem /usr/include/OpenEXR -isystem /usr/include/python3.7m  -O2 -g -pipe -Wall -Werror=format-security -Wp,-D_FORTIFY_SOURCE=2 -Wp,-D_GLIBCXX_ASSERTIONS -fexceptions -fstack-protector-strong -grecord-gcc-switches -specs=/usr/lib/rpm/redhat/redhat-hardened-cc1 -specs=/usr/lib/rpm/redhat/redhat-annobin-cc1 -fasynchronous-unwind-tables -fstack-clash-protection -Wl,--as-needed -fPIC   -DOPENVDB_PRIVATE -DOPENVDB_USE_BLOSC  -o CMakeFiles/pyopenvdb.dir/pyVec3Grid.cc.o -c /builddir/build/BUILD/openvdb-5.1.0/openvdb/python/pyVec3Grid.cc
make[2]: Leaving directory '/builddir/build/BUILD/openvdb-5.1.0'
make[2]: Entering directory '/builddir/build/BUILD/openvdb-5.1.0'
[ 55%] Linking CXX shared library pyopenvdb.so
cd /builddir/build/BUILD/openvdb-5.1.0/openvdb/python && /usr/bin/cmake -E cmake_link_script CMakeFiles/pyopenvdb.dir/link.txt --verbose=1
/usr/bin/c++ -fPIC -O2 -g -pipe -Wall -Werror=format-security -Wp,-D_FORTIFY_SOURCE=2 -Wp,-D_GLIBCXX_ASSERTIONS -fexceptions -fstack-protector-strong -grecord-gcc-switches -specs=/usr/lib/rpm/redhat/redhat-hardened-cc1 -specs=/usr/lib/rpm/redhat/redhat-annobin-cc1 -fasynchronous-unwind-tables -fstack-clash-protection -Wl,--as-needed -Wl,-z,relro   -Wl,-z,now -specs=/usr/lib/rpm/redhat/redhat-hardened-ld -shared -Wl,-soname,pyopenvdb.so -o pyopenvdb.so CMakeFiles/pyopenvdb.dir/pyFloatGrid.cc.o CMakeFiles/pyopenvdb.dir/pyIntGrid.cc.o CMakeFiles/pyopenvdb.dir/pyMetadata.cc.o CMakeFiles/pyopenvdb.dir/pyOpenVDBModule.cc.o CMakeFiles/pyopenvdb.dir/pyTransform.cc.o CMakeFiles/pyopenvdb.dir/pyVec3Grid.cc.o -Wl,-rpath,/builddir/build/BUILD/openvdb-5.1.0/openvdb: ../libopenvdb.so.5.1.0 -lGL -lGLU -lpython3.7m -lHalf -lboost_iostreams -lboost_system -ltbb -lz -lblosc -lHalf 
make[2]: Leaving directory '/builddir/build/BUILD/openvdb-5.1.0'
make[1]: Entering directory '/builddir/build/BUILD/openvdb-5.1.0'
[ 55%] Built target pyopenvdb
make[1]: Leaving directory '/builddir/build/BUILD/openvdb-5.1.0'
make[2]: Entering directory '/builddir/build/BUILD/openvdb-5.1.0'
[ 52%] Building CXX object openvdb/CMakeFiles/vdb_test.dir/unittest/TestDivergence.cc.o
cd /builddir/build/BUILD/openvdb-5.1.0/openvdb && /usr/bin/c++  -DOPENVDB_ABI_VERSION_NUMBER=3 -I/builddir/build/BUILD/openvdb-5.1.0 -I/builddir/build/BUILD/openvdb-5.1.0/openvdb/. -I/builddir/build/BUILD/openvdb-5.1.0/dwa -isystem /usr/include/OpenEXR  -O2 -g -pipe -Wall -Werror=format-security -Wp,-D_FORTIFY_SOURCE=2 -Wp,-D_GLIBCXX_ASSERTIONS -fexceptions -fstack-protector-strong -grecord-gcc-switches -specs=/usr/lib/rpm/redhat/redhat-hardened-cc1 -specs=/usr/lib/rpm/redhat/redhat-annobin-cc1 -fasynchronous-unwind-tables -fstack-clash-protection -Wl,--as-needed   -pthread -fPIC -std=gnu++11 -DOPENVDB_USE_BLOSC -o CMakeFiles/vdb_test.dir/unittest/TestDivergence.cc.o -c /builddir/build/BUILD/openvdb-5.1.0/openvdb/unittest/TestDivergence.cc
make[2]: Leaving directory '/builddir/build/BUILD/openvdb-5.1.0'
BUILDSTDERR: make[1]: *** [CMakeFiles/Makefile2:289: openvdb/CMakeFiles/vdb_test.dir/all] Error 2
BUILDSTDERR: make: *** [Makefile:144: all] Error 2
BUILDSTDERR: error: Bad exit status from /var/tmp/rpm-tmp.1MwJKZ (%build)
RPM build errors:
BUILDSTDERR:     Bad exit status from /var/tmp/rpm-tmp.1MwJKZ (%build)
Child return code was: 1
EXCEPTION: [Error()]
Traceback (most recent call last):
  File "/usr/lib/python3.7/site-packages/mockbuild/trace_decorator.py", line 96, in trace
    result = func(*args, **kw)
  File "/usr/lib/python3.7/site-packages/mockbuild/util.py", line 636, in do
    raise exception.Error("Command failed: \n # %s\n%s" % (command, output), child.returncode)
mockbuild.exception.Error: Command failed: 
 # bash --login -c /usr/bin/rpmbuild -bb --target riscv64 --nodeps /builddir/build/SPECS/openvdb.spec