Mock Version: 2.15
Mock Version: 2.15
Mock Version: 2.15
ENTER ['do_with_status'](['bash', '--login', '-c', '/usr/bin/rpmbuild -bs --target riscv64 --nodeps /builddir/build/SPECS/python-ldap.spec'], chrootPath='/var/lib/mock/f40-build-731028-103621/root'env={'TERM': 'vt100', 'SHELL': '/bin/bash', 'HOME': '/builddir', 'HOSTNAME': 'mock', 'PATH': '/usr/bin:/bin:/usr/sbin:/sbin', 'PROMPT_COMMAND': 'printf "\\033]0;<mock-chroot>\\007"', 'PS1': '<mock-chroot> \\s-\\v\\$ ', 'LANG': 'C.UTF-8'}shell=Falselogger=<mockbuild.trace_decorator.getLog object at 0x3f7291ec10>timeout=604800uid=991gid=135user='mockbuild'nspawn_args=[]unshare_net=TrueprintOutput=False)
Executing command: ['bash', '--login', '-c', '/usr/bin/rpmbuild -bs --target riscv64 --nodeps /builddir/build/SPECS/python-ldap.spec'] with env {'TERM': 'vt100', 'SHELL': '/bin/bash', 'HOME': '/builddir', 'HOSTNAME': 'mock', 'PATH': '/usr/bin:/bin:/usr/sbin:/sbin', 'PROMPT_COMMAND': 'printf "\\033]0;<mock-chroot>\\007"', 'PS1': '<mock-chroot> \\s-\\v\\$ ', 'LANG': 'C.UTF-8'} and shell False
Building target platforms: riscv64
Building for target riscv64
setting SOURCE_DATE_EPOCH=1689897600
Wrote: /builddir/build/SRPMS/python-ldap-3.4.3-4.fc40.src.rpm
Child return code was: 0
ENTER ['do_with_status'](['bash', '--login', '-c', '/usr/bin/rpmbuild -bb --target riscv64 --nodeps /builddir/build/SPECS/python-ldap.spec'], chrootPath='/var/lib/mock/f40-build-731028-103621/root'env={'TERM': 'vt100', 'SHELL': '/bin/bash', 'HOME': '/builddir', 'HOSTNAME': 'mock', 'PATH': '/usr/bin:/bin:/usr/sbin:/sbin', 'PROMPT_COMMAND': 'printf "\\033]0;<mock-chroot>\\007"', 'PS1': '<mock-chroot> \\s-\\v\\$ ', 'LANG': 'C.UTF-8'}shell=Falselogger=<mockbuild.trace_decorator.getLog object at 0x3f7291ec10>timeout=604800uid=991gid=135user='mockbuild'nspawn_args=[]unshare_net=TrueprintOutput=False)
Executing command: ['bash', '--login', '-c', '/usr/bin/rpmbuild -bb --target riscv64 --nodeps /builddir/build/SPECS/python-ldap.spec'] with env {'TERM': 'vt100', 'SHELL': '/bin/bash', 'HOME': '/builddir', 'HOSTNAME': 'mock', 'PATH': '/usr/bin:/bin:/usr/sbin:/sbin', 'PROMPT_COMMAND': 'printf "\\033]0;<mock-chroot>\\007"', 'PS1': '<mock-chroot> \\s-\\v\\$ ', 'LANG': 'C.UTF-8'} and shell False
Building target platforms: riscv64
Building for target riscv64
setting SOURCE_DATE_EPOCH=1689897600
Executing(%prep): /bin/sh -e /var/tmp/rpm-tmp.BNiZSY
+ umask 022
+ cd /builddir/build/BUILD
+ cd /builddir/build/BUILD
+ rm -rf python-ldap-3.4.3
+ /usr/lib/rpm/rpmuncompress -x /builddir/build/SOURCES/python-ldap-3.4.3.tar.gz
+ STATUS=0
+ '[' 0 -ne 0 ']'
+ cd python-ldap-3.4.3
+ rm -rf /builddir/build/BUILD/python-ldap-3.4.3-SPECPARTS
+ /usr/bin/mkdir -p /builddir/build/BUILD/python-ldap-3.4.3-SPECPARTS
+ /usr/bin/chmod -Rf a+rX,u+w,g-w,o-w .
+ find . -name '*.py'
+ xargs sed -i '1s|^#!/usr/bin/env python|#!/usr/bin/python3|'
+ RPM_EC=0
++ jobs -p
+ exit 0
Executing(%build): /bin/sh -e /var/tmp/rpm-tmp.HhevNs
+ umask 022
+ cd /builddir/build/BUILD
+ CFLAGS='-O2 -flto=auto -ffat-lto-objects -fexceptions -g -grecord-gcc-switches -pipe -Wall -Werror=format-security -Werror=implicit-function-declaration -Werror=implicit-int -Wp,-U_FORTIFY_SOURCE,-D_FORTIFY_SOURCE=3 -Wp,-D_GLIBCXX_ASSERTIONS -specs=/usr/lib/rpm/redhat/redhat-hardened-cc1 -fstack-protector-strong -specs=/usr/lib/rpm/redhat/redhat-annobin-cc1  -fasynchronous-unwind-tables -fno-omit-frame-pointer '
+ export CFLAGS
+ CXXFLAGS='-O2 -flto=auto -ffat-lto-objects -fexceptions -g -grecord-gcc-switches -pipe -Wall -Werror=format-security -Wp,-U_FORTIFY_SOURCE,-D_FORTIFY_SOURCE=3 -Wp,-D_GLIBCXX_ASSERTIONS -specs=/usr/lib/rpm/redhat/redhat-hardened-cc1 -fstack-protector-strong -specs=/usr/lib/rpm/redhat/redhat-annobin-cc1  -fasynchronous-unwind-tables -fno-omit-frame-pointer '
+ export CXXFLAGS
+ FFLAGS='-O2 -flto=auto -ffat-lto-objects -fexceptions -g -grecord-gcc-switches -pipe -Wall -Wp,-U_FORTIFY_SOURCE,-D_FORTIFY_SOURCE=3 -Wp,-D_GLIBCXX_ASSERTIONS -specs=/usr/lib/rpm/redhat/redhat-hardened-cc1 -fstack-protector-strong -specs=/usr/lib/rpm/redhat/redhat-annobin-cc1  -fasynchronous-unwind-tables -fno-omit-frame-pointer -I/usr/lib64/gfortran/modules '
+ export FFLAGS
+ FCFLAGS='-O2 -flto=auto -ffat-lto-objects -fexceptions -g -grecord-gcc-switches -pipe -Wall -Wp,-U_FORTIFY_SOURCE,-D_FORTIFY_SOURCE=3 -Wp,-D_GLIBCXX_ASSERTIONS -specs=/usr/lib/rpm/redhat/redhat-hardened-cc1 -fstack-protector-strong -specs=/usr/lib/rpm/redhat/redhat-annobin-cc1  -fasynchronous-unwind-tables -fno-omit-frame-pointer -I/usr/lib64/gfortran/modules '
+ export FCFLAGS
+ VALAFLAGS=-g
+ export VALAFLAGS
+ RUSTFLAGS='-Copt-level=3 -Cdebuginfo=2 -Ccodegen-units=1 -Cforce-frame-pointers=yes -Clink-arg=-Wl,-z,relro -Clink-arg=-Wl,-z,now -Clink-arg=-specs=/usr/lib/rpm/redhat/redhat-package-notes --cap-lints=warn'
+ export RUSTFLAGS
+ LDFLAGS='-Wl,-z,relro -Wl,--as-needed  -Wl,-z,now -specs=/usr/lib/rpm/redhat/redhat-hardened-ld -specs=/usr/lib/rpm/redhat/redhat-annobin-cc1  -Wl,--build-id=sha1 -specs=/usr/lib/rpm/redhat/redhat-package-notes '
+ export LDFLAGS
+ LT_SYS_LIBRARY_PATH=/usr/lib64:
+ export LT_SYS_LIBRARY_PATH
+ CC=gcc
+ export CC
+ CXX=g++
+ export CXX
+ cd python-ldap-3.4.3
+ CFLAGS='-O2 -flto=auto -ffat-lto-objects -fexceptions -g -grecord-gcc-switches -pipe -Wall -Werror=format-security -Werror=implicit-function-declaration -Werror=implicit-int -Wp,-U_FORTIFY_SOURCE,-D_FORTIFY_SOURCE=3 -Wp,-D_GLIBCXX_ASSERTIONS -specs=/usr/lib/rpm/redhat/redhat-hardened-cc1 -fstack-protector-strong -specs=/usr/lib/rpm/redhat/redhat-annobin-cc1  -fasynchronous-unwind-tables -fno-omit-frame-pointer '
+ LDFLAGS='-Wl,-z,relro -Wl,--as-needed  -Wl,-z,now -specs=/usr/lib/rpm/redhat/redhat-hardened-ld -specs=/usr/lib/rpm/redhat/redhat-annobin-cc1  -Wl,--build-id=sha1 -specs=/usr/lib/rpm/redhat/redhat-package-notes '
+ /usr/bin/python3 setup.py build '--executable=/usr/bin/python3 -sP'
/usr/lib/python3.12/site-packages/setuptools/config/setupcfg.py:293: _DeprecatedConfig: Deprecated config in `setup.cfg`
!!
        ********************************************************************************
        The license_file parameter is deprecated, use license_files instead.
        By 2023-Oct-30, you need to update your project and remove deprecated calls
        or your builds will no longer be supported.
        See https://setuptools.pypa.io/en/latest/userguide/declarative_config.html for details.
        ********************************************************************************
!!
  parsed = self.parsers.get(option_name, lambda x: x)(value)
running build
running build_py
creating build
creating build/lib.linux-riscv64-cpython-312
copying Lib/ldapurl.py -> build/lib.linux-riscv64-cpython-312
copying Lib/ldif.py -> build/lib.linux-riscv64-cpython-312
creating build/lib.linux-riscv64-cpython-312/ldap
copying Lib/ldap/sasl.py -> build/lib.linux-riscv64-cpython-312/ldap
copying Lib/ldap/asyncsearch.py -> build/lib.linux-riscv64-cpython-312/ldap
copying Lib/ldap/constants.py -> build/lib.linux-riscv64-cpython-312/ldap
copying Lib/ldap/modlist.py -> build/lib.linux-riscv64-cpython-312/ldap
copying Lib/ldap/functions.py -> build/lib.linux-riscv64-cpython-312/ldap
copying Lib/ldap/ldapobject.py -> build/lib.linux-riscv64-cpython-312/ldap
copying Lib/ldap/__init__.py -> build/lib.linux-riscv64-cpython-312/ldap
copying Lib/ldap/filter.py -> build/lib.linux-riscv64-cpython-312/ldap
copying Lib/ldap/compat.py -> build/lib.linux-riscv64-cpython-312/ldap
copying Lib/ldap/cidict.py -> build/lib.linux-riscv64-cpython-312/ldap
copying Lib/ldap/async.py -> build/lib.linux-riscv64-cpython-312/ldap
copying Lib/ldap/dn.py -> build/lib.linux-riscv64-cpython-312/ldap
copying Lib/ldap/logger.py -> build/lib.linux-riscv64-cpython-312/ldap
copying Lib/ldap/pkginfo.py -> build/lib.linux-riscv64-cpython-312/ldap
copying Lib/ldap/resiter.py -> build/lib.linux-riscv64-cpython-312/ldap
copying Lib/ldap/syncrepl.py -> build/lib.linux-riscv64-cpython-312/ldap
creating build/lib.linux-riscv64-cpython-312/ldap/controls
copying Lib/ldap/controls/pwdpolicy.py -> build/lib.linux-riscv64-cpython-312/ldap/controls
copying Lib/ldap/controls/readentry.py -> build/lib.linux-riscv64-cpython-312/ldap/controls
copying Lib/ldap/controls/sessiontrack.py -> build/lib.linux-riscv64-cpython-312/ldap/controls
copying Lib/ldap/controls/pagedresults.py -> build/lib.linux-riscv64-cpython-312/ldap/controls
copying Lib/ldap/controls/ppolicy.py -> build/lib.linux-riscv64-cpython-312/ldap/controls
copying Lib/ldap/controls/deref.py -> build/lib.linux-riscv64-cpython-312/ldap/controls
copying Lib/ldap/controls/__init__.py -> build/lib.linux-riscv64-cpython-312/ldap/controls
copying Lib/ldap/controls/vlv.py -> build/lib.linux-riscv64-cpython-312/ldap/controls
copying Lib/ldap/controls/psearch.py -> build/lib.linux-riscv64-cpython-312/ldap/controls
copying Lib/ldap/controls/simple.py -> build/lib.linux-riscv64-cpython-312/ldap/controls
copying Lib/ldap/controls/sss.py -> build/lib.linux-riscv64-cpython-312/ldap/controls
copying Lib/ldap/controls/libldap.py -> build/lib.linux-riscv64-cpython-312/ldap/controls
copying Lib/ldap/controls/openldap.py -> build/lib.linux-riscv64-cpython-312/ldap/controls
creating build/lib.linux-riscv64-cpython-312/ldap/extop
copying Lib/ldap/extop/dds.py -> build/lib.linux-riscv64-cpython-312/ldap/extop
copying Lib/ldap/extop/passwd.py -> build/lib.linux-riscv64-cpython-312/ldap/extop
copying Lib/ldap/extop/__init__.py -> build/lib.linux-riscv64-cpython-312/ldap/extop
creating build/lib.linux-riscv64-cpython-312/ldap/schema
copying Lib/ldap/schema/subentry.py -> build/lib.linux-riscv64-cpython-312/ldap/schema
copying Lib/ldap/schema/tokenizer.py -> build/lib.linux-riscv64-cpython-312/ldap/schema
copying Lib/ldap/schema/__init__.py -> build/lib.linux-riscv64-cpython-312/ldap/schema
copying Lib/ldap/schema/models.py -> build/lib.linux-riscv64-cpython-312/ldap/schema
creating build/lib.linux-riscv64-cpython-312/slapdtest
copying Lib/slapdtest/_slapdtest.py -> build/lib.linux-riscv64-cpython-312/slapdtest
copying Lib/slapdtest/__init__.py -> build/lib.linux-riscv64-cpython-312/slapdtest
running egg_info
writing Lib/python_ldap.egg-info/PKG-INFO
writing dependency_links to Lib/python_ldap.egg-info/dependency_links.txt
writing requirements to Lib/python_ldap.egg-info/requires.txt
writing top-level names to Lib/python_ldap.egg-info/top_level.txt
reading manifest file 'Lib/python_ldap.egg-info/SOURCES.txt'
reading manifest template 'MANIFEST.in'
no previously-included directories found matching 'Doc/.build'
adding license file 'LICENCE'
writing manifest file 'Lib/python_ldap.egg-info/SOURCES.txt'
creating build/lib.linux-riscv64-cpython-312/slapdtest/certs
copying Lib/slapdtest/certs/README -> build/lib.linux-riscv64-cpython-312/slapdtest/certs
copying Lib/slapdtest/certs/ca.conf -> build/lib.linux-riscv64-cpython-312/slapdtest/certs
copying Lib/slapdtest/certs/ca.pem -> build/lib.linux-riscv64-cpython-312/slapdtest/certs
copying Lib/slapdtest/certs/client.conf -> build/lib.linux-riscv64-cpython-312/slapdtest/certs
copying Lib/slapdtest/certs/client.key -> build/lib.linux-riscv64-cpython-312/slapdtest/certs
copying Lib/slapdtest/certs/client.pem -> build/lib.linux-riscv64-cpython-312/slapdtest/certs
copying Lib/slapdtest/certs/gencerts.sh -> build/lib.linux-riscv64-cpython-312/slapdtest/certs
copying Lib/slapdtest/certs/gennssdb.sh -> build/lib.linux-riscv64-cpython-312/slapdtest/certs
copying Lib/slapdtest/certs/server.conf -> build/lib.linux-riscv64-cpython-312/slapdtest/certs
copying Lib/slapdtest/certs/server.key -> build/lib.linux-riscv64-cpython-312/slapdtest/certs
copying Lib/slapdtest/certs/server.pem -> build/lib.linux-riscv64-cpython-312/slapdtest/certs
running build_ext
building '_ldap' extension
creating build/temp.linux-riscv64-cpython-312
creating build/temp.linux-riscv64-cpython-312/Modules
gcc -fno-strict-overflow -Wsign-compare -DNDEBUG -fexceptions -fexceptions -fexceptions -O2 -flto=auto -ffat-lto-objects -fexceptions -g -grecord-gcc-switches -pipe -Wall -Werror=format-security -Werror=implicit-function-declaration -Werror=implicit-int -Wp,-U_FORTIFY_SOURCE,-D_FORTIFY_SOURCE=3 -Wp,-D_GLIBCXX_ASSERTIONS -specs=/usr/lib/rpm/redhat/redhat-hardened-cc1 -fstack-protector-strong -specs=/usr/lib/rpm/redhat/redhat-annobin-cc1 -fasynchronous-unwind-tables -fno-omit-frame-pointer -fPIC -DHAVE_SASL -DHAVE_TLS -DLDAPMODULE_VERSION=3.4.3 "-DLDAPMODULE_AUTHOR=python-ldap project" "-DLDAPMODULE_LICENSE=Python style" -IModules -I/usr/include/python3.12 -c Modules/LDAPObject.c -o build/temp.linux-riscv64-cpython-312/Modules/LDAPObject.o
gcc -fno-strict-overflow -Wsign-compare -DNDEBUG -fexceptions -fexceptions -fexceptions -O2 -flto=auto -ffat-lto-objects -fexceptions -g -grecord-gcc-switches -pipe -Wall -Werror=format-security -Werror=implicit-function-declaration -Werror=implicit-int -Wp,-U_FORTIFY_SOURCE,-D_FORTIFY_SOURCE=3 -Wp,-D_GLIBCXX_ASSERTIONS -specs=/usr/lib/rpm/redhat/redhat-hardened-cc1 -fstack-protector-strong -specs=/usr/lib/rpm/redhat/redhat-annobin-cc1 -fasynchronous-unwind-tables -fno-omit-frame-pointer -fPIC -DHAVE_SASL -DHAVE_TLS -DLDAPMODULE_VERSION=3.4.3 "-DLDAPMODULE_AUTHOR=python-ldap project" "-DLDAPMODULE_LICENSE=Python style" -IModules -I/usr/include/python3.12 -c Modules/berval.c -o build/temp.linux-riscv64-cpython-312/Modules/berval.o
gcc -fno-strict-overflow -Wsign-compare -DNDEBUG -fexceptions -fexceptions -fexceptions -O2 -flto=auto -ffat-lto-objects -fexceptions -g -grecord-gcc-switches -pipe -Wall -Werror=format-security -Werror=implicit-function-declaration -Werror=implicit-int -Wp,-U_FORTIFY_SOURCE,-D_FORTIFY_SOURCE=3 -Wp,-D_GLIBCXX_ASSERTIONS -specs=/usr/lib/rpm/redhat/redhat-hardened-cc1 -fstack-protector-strong -specs=/usr/lib/rpm/redhat/redhat-annobin-cc1 -fasynchronous-unwind-tables -fno-omit-frame-pointer -fPIC -DHAVE_SASL -DHAVE_TLS -DLDAPMODULE_VERSION=3.4.3 "-DLDAPMODULE_AUTHOR=python-ldap project" "-DLDAPMODULE_LICENSE=Python style" -IModules -I/usr/include/python3.12 -c Modules/common.c -o build/temp.linux-riscv64-cpython-312/Modules/common.o
gcc -fno-strict-overflow -Wsign-compare -DNDEBUG -fexceptions -fexceptions -fexceptions -O2 -flto=auto -ffat-lto-objects -fexceptions -g -grecord-gcc-switches -pipe -Wall -Werror=format-security -Werror=implicit-function-declaration -Werror=implicit-int -Wp,-U_FORTIFY_SOURCE,-D_FORTIFY_SOURCE=3 -Wp,-D_GLIBCXX_ASSERTIONS -specs=/usr/lib/rpm/redhat/redhat-hardened-cc1 -fstack-protector-strong -specs=/usr/lib/rpm/redhat/redhat-annobin-cc1 -fasynchronous-unwind-tables -fno-omit-frame-pointer -fPIC -DHAVE_SASL -DHAVE_TLS -DLDAPMODULE_VERSION=3.4.3 "-DLDAPMODULE_AUTHOR=python-ldap project" "-DLDAPMODULE_LICENSE=Python style" -IModules -I/usr/include/python3.12 -c Modules/constants.c -o build/temp.linux-riscv64-cpython-312/Modules/constants.o
gcc -fno-strict-overflow -Wsign-compare -DNDEBUG -fexceptions -fexceptions -fexceptions -O2 -flto=auto -ffat-lto-objects -fexceptions -g -grecord-gcc-switches -pipe -Wall -Werror=format-security -Werror=implicit-function-declaration -Werror=implicit-int -Wp,-U_FORTIFY_SOURCE,-D_FORTIFY_SOURCE=3 -Wp,-D_GLIBCXX_ASSERTIONS -specs=/usr/lib/rpm/redhat/redhat-hardened-cc1 -fstack-protector-strong -specs=/usr/lib/rpm/redhat/redhat-annobin-cc1 -fasynchronous-unwind-tables -fno-omit-frame-pointer -fPIC -DHAVE_SASL -DHAVE_TLS -DLDAPMODULE_VERSION=3.4.3 "-DLDAPMODULE_AUTHOR=python-ldap project" "-DLDAPMODULE_LICENSE=Python style" -IModules -I/usr/include/python3.12 -c Modules/functions.c -o build/temp.linux-riscv64-cpython-312/Modules/functions.o
gcc -fno-strict-overflow -Wsign-compare -DNDEBUG -fexceptions -fexceptions -fexceptions -O2 -flto=auto -ffat-lto-objects -fexceptions -g -grecord-gcc-switches -pipe -Wall -Werror=format-security -Werror=implicit-function-declaration -Werror=implicit-int -Wp,-U_FORTIFY_SOURCE,-D_FORTIFY_SOURCE=3 -Wp,-D_GLIBCXX_ASSERTIONS -specs=/usr/lib/rpm/redhat/redhat-hardened-cc1 -fstack-protector-strong -specs=/usr/lib/rpm/redhat/redhat-annobin-cc1 -fasynchronous-unwind-tables -fno-omit-frame-pointer -fPIC -DHAVE_SASL -DHAVE_TLS -DLDAPMODULE_VERSION=3.4.3 "-DLDAPMODULE_AUTHOR=python-ldap project" "-DLDAPMODULE_LICENSE=Python style" -IModules -I/usr/include/python3.12 -c Modules/ldapcontrol.c -o build/temp.linux-riscv64-cpython-312/Modules/ldapcontrol.o
gcc -fno-strict-overflow -Wsign-compare -DNDEBUG -fexceptions -fexceptions -fexceptions -O2 -flto=auto -ffat-lto-objects -fexceptions -g -grecord-gcc-switches -pipe -Wall -Werror=format-security -Werror=implicit-function-declaration -Werror=implicit-int -Wp,-U_FORTIFY_SOURCE,-D_FORTIFY_SOURCE=3 -Wp,-D_GLIBCXX_ASSERTIONS -specs=/usr/lib/rpm/redhat/redhat-hardened-cc1 -fstack-protector-strong -specs=/usr/lib/rpm/redhat/redhat-annobin-cc1 -fasynchronous-unwind-tables -fno-omit-frame-pointer -fPIC -DHAVE_SASL -DHAVE_TLS -DLDAPMODULE_VERSION=3.4.3 "-DLDAPMODULE_AUTHOR=python-ldap project" "-DLDAPMODULE_LICENSE=Python style" -IModules -I/usr/include/python3.12 -c Modules/ldapmodule.c -o build/temp.linux-riscv64-cpython-312/Modules/ldapmodule.o
gcc -fno-strict-overflow -Wsign-compare -DNDEBUG -fexceptions -fexceptions -fexceptions -O2 -flto=auto -ffat-lto-objects -fexceptions -g -grecord-gcc-switches -pipe -Wall -Werror=format-security -Werror=implicit-function-declaration -Werror=implicit-int -Wp,-U_FORTIFY_SOURCE,-D_FORTIFY_SOURCE=3 -Wp,-D_GLIBCXX_ASSERTIONS -specs=/usr/lib/rpm/redhat/redhat-hardened-cc1 -fstack-protector-strong -specs=/usr/lib/rpm/redhat/redhat-annobin-cc1 -fasynchronous-unwind-tables -fno-omit-frame-pointer -fPIC -DHAVE_SASL -DHAVE_TLS -DLDAPMODULE_VERSION=3.4.3 "-DLDAPMODULE_AUTHOR=python-ldap project" "-DLDAPMODULE_LICENSE=Python style" -IModules -I/usr/include/python3.12 -c Modules/message.c -o build/temp.linux-riscv64-cpython-312/Modules/message.o
gcc -fno-strict-overflow -Wsign-compare -DNDEBUG -fexceptions -fexceptions -fexceptions -O2 -flto=auto -ffat-lto-objects -fexceptions -g -grecord-gcc-switches -pipe -Wall -Werror=format-security -Werror=implicit-function-declaration -Werror=implicit-int -Wp,-U_FORTIFY_SOURCE,-D_FORTIFY_SOURCE=3 -Wp,-D_GLIBCXX_ASSERTIONS -specs=/usr/lib/rpm/redhat/redhat-hardened-cc1 -fstack-protector-strong -specs=/usr/lib/rpm/redhat/redhat-annobin-cc1 -fasynchronous-unwind-tables -fno-omit-frame-pointer -fPIC -DHAVE_SASL -DHAVE_TLS -DLDAPMODULE_VERSION=3.4.3 "-DLDAPMODULE_AUTHOR=python-ldap project" "-DLDAPMODULE_LICENSE=Python style" -IModules -I/usr/include/python3.12 -c Modules/options.c -o build/temp.linux-riscv64-cpython-312/Modules/options.o
gcc -shared -Wl,-z,relro -Wl,--as-needed -Wl,-z,now -specs=/usr/lib/rpm/redhat/redhat-hardened-ld -specs=/usr/lib/rpm/redhat/redhat-annobin-cc1 -Wl,--build-id=sha1 -specs=/usr/lib/rpm/redhat/redhat-package-notes -O2 -flto=auto -ffat-lto-objects -fexceptions -g -grecord-gcc-switches -pipe -Wall -Werror=format-security -Werror=implicit-function-declaration -Werror=implicit-int -Wp,-U_FORTIFY_SOURCE,-D_FORTIFY_SOURCE=3 -Wp,-D_GLIBCXX_ASSERTIONS -specs=/usr/lib/rpm/redhat/redhat-hardened-cc1 -fstack-protector-strong -specs=/usr/lib/rpm/redhat/redhat-annobin-cc1 -fasynchronous-unwind-tables -fno-omit-frame-pointer build/temp.linux-riscv64-cpython-312/Modules/LDAPObject.o build/temp.linux-riscv64-cpython-312/Modules/berval.o build/temp.linux-riscv64-cpython-312/Modules/common.o build/temp.linux-riscv64-cpython-312/Modules/constants.o build/temp.linux-riscv64-cpython-312/Modules/functions.o build/temp.linux-riscv64-cpython-312/Modules/ldapcontrol.o build/temp.linux-riscv64-cpython-312/Modules/ldapmodule.o build/temp.linux-riscv64-cpython-312/Modules/message.o build/temp.linux-riscv64-cpython-312/Modules/options.o -L/usr/lib64 -lldap -llber -o build/lib.linux-riscv64-cpython-312/_ldap.cpython-312-riscv64-linux-gnu.so
+ RPM_EC=0
++ jobs -p
+ exit 0
Executing(%install): /bin/sh -e /var/tmp/rpm-tmp.F16o7J
+ umask 022
+ cd /builddir/build/BUILD
+ '[' /builddir/build/BUILDROOT/python-ldap-3.4.3-4.fc40.riscv64 '!=' / ']'
+ rm -rf /builddir/build/BUILDROOT/python-ldap-3.4.3-4.fc40.riscv64
++ dirname /builddir/build/BUILDROOT/python-ldap-3.4.3-4.fc40.riscv64
+ mkdir -p /builddir/build/BUILDROOT
+ mkdir /builddir/build/BUILDROOT/python-ldap-3.4.3-4.fc40.riscv64
+ CFLAGS='-O2 -flto=auto -ffat-lto-objects -fexceptions -g -grecord-gcc-switches -pipe -Wall -Werror=format-security -Werror=implicit-function-declaration -Werror=implicit-int -Wp,-U_FORTIFY_SOURCE,-D_FORTIFY_SOURCE=3 -Wp,-D_GLIBCXX_ASSERTIONS -specs=/usr/lib/rpm/redhat/redhat-hardened-cc1 -fstack-protector-strong -specs=/usr/lib/rpm/redhat/redhat-annobin-cc1  -fasynchronous-unwind-tables -fno-omit-frame-pointer '
+ export CFLAGS
+ CXXFLAGS='-O2 -flto=auto -ffat-lto-objects -fexceptions -g -grecord-gcc-switches -pipe -Wall -Werror=format-security -Wp,-U_FORTIFY_SOURCE,-D_FORTIFY_SOURCE=3 -Wp,-D_GLIBCXX_ASSERTIONS -specs=/usr/lib/rpm/redhat/redhat-hardened-cc1 -fstack-protector-strong -specs=/usr/lib/rpm/redhat/redhat-annobin-cc1  -fasynchronous-unwind-tables -fno-omit-frame-pointer '
+ export CXXFLAGS
+ FFLAGS='-O2 -flto=auto -ffat-lto-objects -fexceptions -g -grecord-gcc-switches -pipe -Wall -Wp,-U_FORTIFY_SOURCE,-D_FORTIFY_SOURCE=3 -Wp,-D_GLIBCXX_ASSERTIONS -specs=/usr/lib/rpm/redhat/redhat-hardened-cc1 -fstack-protector-strong -specs=/usr/lib/rpm/redhat/redhat-annobin-cc1  -fasynchronous-unwind-tables -fno-omit-frame-pointer -I/usr/lib64/gfortran/modules '
+ export FFLAGS
+ FCFLAGS='-O2 -flto=auto -ffat-lto-objects -fexceptions -g -grecord-gcc-switches -pipe -Wall -Wp,-U_FORTIFY_SOURCE,-D_FORTIFY_SOURCE=3 -Wp,-D_GLIBCXX_ASSERTIONS -specs=/usr/lib/rpm/redhat/redhat-hardened-cc1 -fstack-protector-strong -specs=/usr/lib/rpm/redhat/redhat-annobin-cc1  -fasynchronous-unwind-tables -fno-omit-frame-pointer -I/usr/lib64/gfortran/modules '
+ export FCFLAGS
+ VALAFLAGS=-g
+ export VALAFLAGS
+ RUSTFLAGS='-Copt-level=3 -Cdebuginfo=2 -Ccodegen-units=1 -Cforce-frame-pointers=yes -Clink-arg=-Wl,-z,relro -Clink-arg=-Wl,-z,now -Clink-arg=-specs=/usr/lib/rpm/redhat/redhat-package-notes --cap-lints=warn'
+ export RUSTFLAGS
+ LDFLAGS='-Wl,-z,relro -Wl,--as-needed  -Wl,-z,now -specs=/usr/lib/rpm/redhat/redhat-hardened-ld -specs=/usr/lib/rpm/redhat/redhat-annobin-cc1  -Wl,--build-id=sha1 -specs=/usr/lib/rpm/redhat/redhat-package-notes '
+ export LDFLAGS
+ LT_SYS_LIBRARY_PATH=/usr/lib64:
+ export LT_SYS_LIBRARY_PATH
+ CC=gcc
+ export CC
+ CXX=g++
+ export CXX
+ cd python-ldap-3.4.3
+ CFLAGS='-O2 -flto=auto -ffat-lto-objects -fexceptions -g -grecord-gcc-switches -pipe -Wall -Werror=format-security -Werror=implicit-function-declaration -Werror=implicit-int -Wp,-U_FORTIFY_SOURCE,-D_FORTIFY_SOURCE=3 -Wp,-D_GLIBCXX_ASSERTIONS -specs=/usr/lib/rpm/redhat/redhat-hardened-cc1 -fstack-protector-strong -specs=/usr/lib/rpm/redhat/redhat-annobin-cc1  -fasynchronous-unwind-tables -fno-omit-frame-pointer '
+ LDFLAGS='-Wl,-z,relro -Wl,--as-needed  -Wl,-z,now -specs=/usr/lib/rpm/redhat/redhat-hardened-ld -specs=/usr/lib/rpm/redhat/redhat-annobin-cc1  -Wl,--build-id=sha1 -specs=/usr/lib/rpm/redhat/redhat-package-notes '
+ /usr/bin/python3 setup.py install -O1 --skip-build --root /builddir/build/BUILDROOT/python-ldap-3.4.3-4.fc40.riscv64 --prefix /usr
/usr/lib/python3.12/site-packages/setuptools/config/setupcfg.py:293: _DeprecatedConfig: Deprecated config in `setup.cfg`
!!
        ********************************************************************************
        The license_file parameter is deprecated, use license_files instead.
        By 2023-Oct-30, you need to update your project and remove deprecated calls
        or your builds will no longer be supported.
        See https://setuptools.pypa.io/en/latest/userguide/declarative_config.html for details.
        ********************************************************************************
!!
  parsed = self.parsers.get(option_name, lambda x: x)(value)
running install
/usr/lib/python3.12/site-packages/setuptools/_distutils/cmd.py:66: SetuptoolsDeprecationWarning: setup.py install is deprecated.
!!
        ********************************************************************************
        Please avoid running ``setup.py`` directly.
        Instead, use pypa/build, pypa/installer or other
        standards-based tools.
        Follow the current Python packaging guidelines when building
        Python RPM packages.
        See https://blog.ganssle.io/articles/2021/10/setup-py-deprecated.html
        and https://docs.fedoraproject.org/en-US/packaging-guidelines/Python/ for details.
        ********************************************************************************
!!
  self.initialize_options()
running install_lib
creating /builddir/build/BUILDROOT/python-ldap-3.4.3-4.fc40.riscv64/usr
creating /builddir/build/BUILDROOT/python-ldap-3.4.3-4.fc40.riscv64/usr/lib64
creating /builddir/build/BUILDROOT/python-ldap-3.4.3-4.fc40.riscv64/usr/lib64/python3.12
creating /builddir/build/BUILDROOT/python-ldap-3.4.3-4.fc40.riscv64/usr/lib64/python3.12/site-packages
copying build/lib.linux-riscv64-cpython-312/ldapurl.py -> /builddir/build/BUILDROOT/python-ldap-3.4.3-4.fc40.riscv64/usr/lib64/python3.12/site-packages
creating /builddir/build/BUILDROOT/python-ldap-3.4.3-4.fc40.riscv64/usr/lib64/python3.12/site-packages/ldap
creating /builddir/build/BUILDROOT/python-ldap-3.4.3-4.fc40.riscv64/usr/lib64/python3.12/site-packages/ldap/controls
copying build/lib.linux-riscv64-cpython-312/ldap/controls/pwdpolicy.py -> /builddir/build/BUILDROOT/python-ldap-3.4.3-4.fc40.riscv64/usr/lib64/python3.12/site-packages/ldap/controls
copying build/lib.linux-riscv64-cpython-312/ldap/controls/readentry.py -> /builddir/build/BUILDROOT/python-ldap-3.4.3-4.fc40.riscv64/usr/lib64/python3.12/site-packages/ldap/controls
copying build/lib.linux-riscv64-cpython-312/ldap/controls/sessiontrack.py -> /builddir/build/BUILDROOT/python-ldap-3.4.3-4.fc40.riscv64/usr/lib64/python3.12/site-packages/ldap/controls
copying build/lib.linux-riscv64-cpython-312/ldap/controls/pagedresults.py -> /builddir/build/BUILDROOT/python-ldap-3.4.3-4.fc40.riscv64/usr/lib64/python3.12/site-packages/ldap/controls
copying build/lib.linux-riscv64-cpython-312/ldap/controls/ppolicy.py -> /builddir/build/BUILDROOT/python-ldap-3.4.3-4.fc40.riscv64/usr/lib64/python3.12/site-packages/ldap/controls
copying build/lib.linux-riscv64-cpython-312/ldap/controls/deref.py -> /builddir/build/BUILDROOT/python-ldap-3.4.3-4.fc40.riscv64/usr/lib64/python3.12/site-packages/ldap/controls
copying build/lib.linux-riscv64-cpython-312/ldap/controls/__init__.py -> /builddir/build/BUILDROOT/python-ldap-3.4.3-4.fc40.riscv64/usr/lib64/python3.12/site-packages/ldap/controls
copying build/lib.linux-riscv64-cpython-312/ldap/controls/vlv.py -> /builddir/build/BUILDROOT/python-ldap-3.4.3-4.fc40.riscv64/usr/lib64/python3.12/site-packages/ldap/controls
copying build/lib.linux-riscv64-cpython-312/ldap/controls/psearch.py -> /builddir/build/BUILDROOT/python-ldap-3.4.3-4.fc40.riscv64/usr/lib64/python3.12/site-packages/ldap/controls
copying build/lib.linux-riscv64-cpython-312/ldap/controls/simple.py -> /builddir/build/BUILDROOT/python-ldap-3.4.3-4.fc40.riscv64/usr/lib64/python3.12/site-packages/ldap/controls
copying build/lib.linux-riscv64-cpython-312/ldap/controls/sss.py -> /builddir/build/BUILDROOT/python-ldap-3.4.3-4.fc40.riscv64/usr/lib64/python3.12/site-packages/ldap/controls
copying build/lib.linux-riscv64-cpython-312/ldap/controls/libldap.py -> /builddir/build/BUILDROOT/python-ldap-3.4.3-4.fc40.riscv64/usr/lib64/python3.12/site-packages/ldap/controls
copying build/lib.linux-riscv64-cpython-312/ldap/controls/openldap.py -> /builddir/build/BUILDROOT/python-ldap-3.4.3-4.fc40.riscv64/usr/lib64/python3.12/site-packages/ldap/controls
copying build/lib.linux-riscv64-cpython-312/ldap/sasl.py -> /builddir/build/BUILDROOT/python-ldap-3.4.3-4.fc40.riscv64/usr/lib64/python3.12/site-packages/ldap
copying build/lib.linux-riscv64-cpython-312/ldap/asyncsearch.py -> /builddir/build/BUILDROOT/python-ldap-3.4.3-4.fc40.riscv64/usr/lib64/python3.12/site-packages/ldap
copying build/lib.linux-riscv64-cpython-312/ldap/constants.py -> /builddir/build/BUILDROOT/python-ldap-3.4.3-4.fc40.riscv64/usr/lib64/python3.12/site-packages/ldap
copying build/lib.linux-riscv64-cpython-312/ldap/modlist.py -> /builddir/build/BUILDROOT/python-ldap-3.4.3-4.fc40.riscv64/usr/lib64/python3.12/site-packages/ldap
copying build/lib.linux-riscv64-cpython-312/ldap/functions.py -> /builddir/build/BUILDROOT/python-ldap-3.4.3-4.fc40.riscv64/usr/lib64/python3.12/site-packages/ldap
copying build/lib.linux-riscv64-cpython-312/ldap/ldapobject.py -> /builddir/build/BUILDROOT/python-ldap-3.4.3-4.fc40.riscv64/usr/lib64/python3.12/site-packages/ldap
copying build/lib.linux-riscv64-cpython-312/ldap/__init__.py -> /builddir/build/BUILDROOT/python-ldap-3.4.3-4.fc40.riscv64/usr/lib64/python3.12/site-packages/ldap
copying build/lib.linux-riscv64-cpython-312/ldap/filter.py -> /builddir/build/BUILDROOT/python-ldap-3.4.3-4.fc40.riscv64/usr/lib64/python3.12/site-packages/ldap
creating /builddir/build/BUILDROOT/python-ldap-3.4.3-4.fc40.riscv64/usr/lib64/python3.12/site-packages/ldap/extop
copying build/lib.linux-riscv64-cpython-312/ldap/extop/dds.py -> /builddir/build/BUILDROOT/python-ldap-3.4.3-4.fc40.riscv64/usr/lib64/python3.12/site-packages/ldap/extop
copying build/lib.linux-riscv64-cpython-312/ldap/extop/passwd.py -> /builddir/build/BUILDROOT/python-ldap-3.4.3-4.fc40.riscv64/usr/lib64/python3.12/site-packages/ldap/extop
copying build/lib.linux-riscv64-cpython-312/ldap/extop/__init__.py -> /builddir/build/BUILDROOT/python-ldap-3.4.3-4.fc40.riscv64/usr/lib64/python3.12/site-packages/ldap/extop
copying build/lib.linux-riscv64-cpython-312/ldap/compat.py -> /builddir/build/BUILDROOT/python-ldap-3.4.3-4.fc40.riscv64/usr/lib64/python3.12/site-packages/ldap
copying build/lib.linux-riscv64-cpython-312/ldap/cidict.py -> /builddir/build/BUILDROOT/python-ldap-3.4.3-4.fc40.riscv64/usr/lib64/python3.12/site-packages/ldap
copying build/lib.linux-riscv64-cpython-312/ldap/async.py -> /builddir/build/BUILDROOT/python-ldap-3.4.3-4.fc40.riscv64/usr/lib64/python3.12/site-packages/ldap
copying build/lib.linux-riscv64-cpython-312/ldap/dn.py -> /builddir/build/BUILDROOT/python-ldap-3.4.3-4.fc40.riscv64/usr/lib64/python3.12/site-packages/ldap
copying build/lib.linux-riscv64-cpython-312/ldap/logger.py -> /builddir/build/BUILDROOT/python-ldap-3.4.3-4.fc40.riscv64/usr/lib64/python3.12/site-packages/ldap
creating /builddir/build/BUILDROOT/python-ldap-3.4.3-4.fc40.riscv64/usr/lib64/python3.12/site-packages/ldap/schema
copying build/lib.linux-riscv64-cpython-312/ldap/schema/subentry.py -> /builddir/build/BUILDROOT/python-ldap-3.4.3-4.fc40.riscv64/usr/lib64/python3.12/site-packages/ldap/schema
copying build/lib.linux-riscv64-cpython-312/ldap/schema/tokenizer.py -> /builddir/build/BUILDROOT/python-ldap-3.4.3-4.fc40.riscv64/usr/lib64/python3.12/site-packages/ldap/schema
copying build/lib.linux-riscv64-cpython-312/ldap/schema/__init__.py -> /builddir/build/BUILDROOT/python-ldap-3.4.3-4.fc40.riscv64/usr/lib64/python3.12/site-packages/ldap/schema
copying build/lib.linux-riscv64-cpython-312/ldap/schema/models.py -> /builddir/build/BUILDROOT/python-ldap-3.4.3-4.fc40.riscv64/usr/lib64/python3.12/site-packages/ldap/schema
copying build/lib.linux-riscv64-cpython-312/ldap/pkginfo.py -> /builddir/build/BUILDROOT/python-ldap-3.4.3-4.fc40.riscv64/usr/lib64/python3.12/site-packages/ldap
copying build/lib.linux-riscv64-cpython-312/ldap/resiter.py -> /builddir/build/BUILDROOT/python-ldap-3.4.3-4.fc40.riscv64/usr/lib64/python3.12/site-packages/ldap
copying build/lib.linux-riscv64-cpython-312/ldap/syncrepl.py -> /builddir/build/BUILDROOT/python-ldap-3.4.3-4.fc40.riscv64/usr/lib64/python3.12/site-packages/ldap
copying build/lib.linux-riscv64-cpython-312/_ldap.cpython-312-riscv64-linux-gnu.so -> /builddir/build/BUILDROOT/python-ldap-3.4.3-4.fc40.riscv64/usr/lib64/python3.12/site-packages
copying build/lib.linux-riscv64-cpython-312/ldif.py -> /builddir/build/BUILDROOT/python-ldap-3.4.3-4.fc40.riscv64/usr/lib64/python3.12/site-packages
creating /builddir/build/BUILDROOT/python-ldap-3.4.3-4.fc40.riscv64/usr/lib64/python3.12/site-packages/slapdtest
creating /builddir/build/BUILDROOT/python-ldap-3.4.3-4.fc40.riscv64/usr/lib64/python3.12/site-packages/slapdtest/certs
copying build/lib.linux-riscv64-cpython-312/slapdtest/certs/gennssdb.sh -> /builddir/build/BUILDROOT/python-ldap-3.4.3-4.fc40.riscv64/usr/lib64/python3.12/site-packages/slapdtest/certs
copying build/lib.linux-riscv64-cpython-312/slapdtest/certs/ca.pem -> /builddir/build/BUILDROOT/python-ldap-3.4.3-4.fc40.riscv64/usr/lib64/python3.12/site-packages/slapdtest/certs
copying build/lib.linux-riscv64-cpython-312/slapdtest/certs/client.pem -> /builddir/build/BUILDROOT/python-ldap-3.4.3-4.fc40.riscv64/usr/lib64/python3.12/site-packages/slapdtest/certs
copying build/lib.linux-riscv64-cpython-312/slapdtest/certs/client.conf -> /builddir/build/BUILDROOT/python-ldap-3.4.3-4.fc40.riscv64/usr/lib64/python3.12/site-packages/slapdtest/certs
copying build/lib.linux-riscv64-cpython-312/slapdtest/certs/gencerts.sh -> /builddir/build/BUILDROOT/python-ldap-3.4.3-4.fc40.riscv64/usr/lib64/python3.12/site-packages/slapdtest/certs
copying build/lib.linux-riscv64-cpython-312/slapdtest/certs/ca.conf -> /builddir/build/BUILDROOT/python-ldap-3.4.3-4.fc40.riscv64/usr/lib64/python3.12/site-packages/slapdtest/certs
copying build/lib.linux-riscv64-cpython-312/slapdtest/certs/README -> /builddir/build/BUILDROOT/python-ldap-3.4.3-4.fc40.riscv64/usr/lib64/python3.12/site-packages/slapdtest/certs
copying build/lib.linux-riscv64-cpython-312/slapdtest/certs/server.pem -> /builddir/build/BUILDROOT/python-ldap-3.4.3-4.fc40.riscv64/usr/lib64/python3.12/site-packages/slapdtest/certs
copying build/lib.linux-riscv64-cpython-312/slapdtest/certs/client.key -> /builddir/build/BUILDROOT/python-ldap-3.4.3-4.fc40.riscv64/usr/lib64/python3.12/site-packages/slapdtest/certs
copying build/lib.linux-riscv64-cpython-312/slapdtest/certs/server.conf -> /builddir/build/BUILDROOT/python-ldap-3.4.3-4.fc40.riscv64/usr/lib64/python3.12/site-packages/slapdtest/certs
copying build/lib.linux-riscv64-cpython-312/slapdtest/certs/server.key -> /builddir/build/BUILDROOT/python-ldap-3.4.3-4.fc40.riscv64/usr/lib64/python3.12/site-packages/slapdtest/certs
copying build/lib.linux-riscv64-cpython-312/slapdtest/_slapdtest.py -> /builddir/build/BUILDROOT/python-ldap-3.4.3-4.fc40.riscv64/usr/lib64/python3.12/site-packages/slapdtest
copying build/lib.linux-riscv64-cpython-312/slapdtest/__init__.py -> /builddir/build/BUILDROOT/python-ldap-3.4.3-4.fc40.riscv64/usr/lib64/python3.12/site-packages/slapdtest
byte-compiling /builddir/build/BUILDROOT/python-ldap-3.4.3-4.fc40.riscv64/usr/lib64/python3.12/site-packages/ldapurl.py to ldapurl.cpython-312.pyc
byte-compiling /builddir/build/BUILDROOT/python-ldap-3.4.3-4.fc40.riscv64/usr/lib64/python3.12/site-packages/ldap/controls/pwdpolicy.py to pwdpolicy.cpython-312.pyc
byte-compiling /builddir/build/BUILDROOT/python-ldap-3.4.3-4.fc40.riscv64/usr/lib64/python3.12/site-packages/ldap/controls/readentry.py to readentry.cpython-312.pyc
byte-compiling /builddir/build/BUILDROOT/python-ldap-3.4.3-4.fc40.riscv64/usr/lib64/python3.12/site-packages/ldap/controls/sessiontrack.py to sessiontrack.cpython-312.pyc
byte-compiling /builddir/build/BUILDROOT/python-ldap-3.4.3-4.fc40.riscv64/usr/lib64/python3.12/site-packages/ldap/controls/pagedresults.py to pagedresults.cpython-312.pyc
byte-compiling /builddir/build/BUILDROOT/python-ldap-3.4.3-4.fc40.riscv64/usr/lib64/python3.12/site-packages/ldap/controls/ppolicy.py to ppolicy.cpython-312.pyc
byte-compiling /builddir/build/BUILDROOT/python-ldap-3.4.3-4.fc40.riscv64/usr/lib64/python3.12/site-packages/ldap/controls/deref.py to deref.cpython-312.pyc
byte-compiling /builddir/build/BUILDROOT/python-ldap-3.4.3-4.fc40.riscv64/usr/lib64/python3.12/site-packages/ldap/controls/__init__.py to __init__.cpython-312.pyc
byte-compiling /builddir/build/BUILDROOT/python-ldap-3.4.3-4.fc40.riscv64/usr/lib64/python3.12/site-packages/ldap/controls/vlv.py to vlv.cpython-312.pyc
byte-compiling /builddir/build/BUILDROOT/python-ldap-3.4.3-4.fc40.riscv64/usr/lib64/python3.12/site-packages/ldap/controls/psearch.py to psearch.cpython-312.pyc
byte-compiling /builddir/build/BUILDROOT/python-ldap-3.4.3-4.fc40.riscv64/usr/lib64/python3.12/site-packages/ldap/controls/simple.py to simple.cpython-312.pyc
byte-compiling /builddir/build/BUILDROOT/python-ldap-3.4.3-4.fc40.riscv64/usr/lib64/python3.12/site-packages/ldap/controls/sss.py to sss.cpython-312.pyc
byte-compiling /builddir/build/BUILDROOT/python-ldap-3.4.3-4.fc40.riscv64/usr/lib64/python3.12/site-packages/ldap/controls/libldap.py to libldap.cpython-312.pyc
byte-compiling /builddir/build/BUILDROOT/python-ldap-3.4.3-4.fc40.riscv64/usr/lib64/python3.12/site-packages/ldap/controls/openldap.py to openldap.cpython-312.pyc
byte-compiling /builddir/build/BUILDROOT/python-ldap-3.4.3-4.fc40.riscv64/usr/lib64/python3.12/site-packages/ldap/sasl.py to sasl.cpython-312.pyc
byte-compiling /builddir/build/BUILDROOT/python-ldap-3.4.3-4.fc40.riscv64/usr/lib64/python3.12/site-packages/ldap/asyncsearch.py to asyncsearch.cpython-312.pyc
byte-compiling /builddir/build/BUILDROOT/python-ldap-3.4.3-4.fc40.riscv64/usr/lib64/python3.12/site-packages/ldap/constants.py to constants.cpython-312.pyc
byte-compiling /builddir/build/BUILDROOT/python-ldap-3.4.3-4.fc40.riscv64/usr/lib64/python3.12/site-packages/ldap/modlist.py to modlist.cpython-312.pyc
byte-compiling /builddir/build/BUILDROOT/python-ldap-3.4.3-4.fc40.riscv64/usr/lib64/python3.12/site-packages/ldap/functions.py to functions.cpython-312.pyc
byte-compiling /builddir/build/BUILDROOT/python-ldap-3.4.3-4.fc40.riscv64/usr/lib64/python3.12/site-packages/ldap/ldapobject.py to ldapobject.cpython-312.pyc
byte-compiling /builddir/build/BUILDROOT/python-ldap-3.4.3-4.fc40.riscv64/usr/lib64/python3.12/site-packages/ldap/__init__.py to __init__.cpython-312.pyc
byte-compiling /builddir/build/BUILDROOT/python-ldap-3.4.3-4.fc40.riscv64/usr/lib64/python3.12/site-packages/ldap/filter.py to filter.cpython-312.pyc
byte-compiling /builddir/build/BUILDROOT/python-ldap-3.4.3-4.fc40.riscv64/usr/lib64/python3.12/site-packages/ldap/extop/dds.py to dds.cpython-312.pyc
byte-compiling /builddir/build/BUILDROOT/python-ldap-3.4.3-4.fc40.riscv64/usr/lib64/python3.12/site-packages/ldap/extop/passwd.py to passwd.cpython-312.pyc
byte-compiling /builddir/build/BUILDROOT/python-ldap-3.4.3-4.fc40.riscv64/usr/lib64/python3.12/site-packages/ldap/extop/__init__.py to __init__.cpython-312.pyc
byte-compiling /builddir/build/BUILDROOT/python-ldap-3.4.3-4.fc40.riscv64/usr/lib64/python3.12/site-packages/ldap/compat.py to compat.cpython-312.pyc
byte-compiling /builddir/build/BUILDROOT/python-ldap-3.4.3-4.fc40.riscv64/usr/lib64/python3.12/site-packages/ldap/cidict.py to cidict.cpython-312.pyc
byte-compiling /builddir/build/BUILDROOT/python-ldap-3.4.3-4.fc40.riscv64/usr/lib64/python3.12/site-packages/ldap/async.py to async.cpython-312.pyc
byte-compiling /builddir/build/BUILDROOT/python-ldap-3.4.3-4.fc40.riscv64/usr/lib64/python3.12/site-packages/ldap/dn.py to dn.cpython-312.pyc
byte-compiling /builddir/build/BUILDROOT/python-ldap-3.4.3-4.fc40.riscv64/usr/lib64/python3.12/site-packages/ldap/logger.py to logger.cpython-312.pyc
byte-compiling /builddir/build/BUILDROOT/python-ldap-3.4.3-4.fc40.riscv64/usr/lib64/python3.12/site-packages/ldap/schema/subentry.py to subentry.cpython-312.pyc
byte-compiling /builddir/build/BUILDROOT/python-ldap-3.4.3-4.fc40.riscv64/usr/lib64/python3.12/site-packages/ldap/schema/tokenizer.py to tokenizer.cpython-312.pyc
byte-compiling /builddir/build/BUILDROOT/python-ldap-3.4.3-4.fc40.riscv64/usr/lib64/python3.12/site-packages/ldap/schema/__init__.py to __init__.cpython-312.pyc
byte-compiling /builddir/build/BUILDROOT/python-ldap-3.4.3-4.fc40.riscv64/usr/lib64/python3.12/site-packages/ldap/schema/models.py to models.cpython-312.pyc
byte-compiling /builddir/build/BUILDROOT/python-ldap-3.4.3-4.fc40.riscv64/usr/lib64/python3.12/site-packages/ldap/pkginfo.py to pkginfo.cpython-312.pyc
byte-compiling /builddir/build/BUILDROOT/python-ldap-3.4.3-4.fc40.riscv64/usr/lib64/python3.12/site-packages/ldap/resiter.py to resiter.cpython-312.pyc
byte-compiling /builddir/build/BUILDROOT/python-ldap-3.4.3-4.fc40.riscv64/usr/lib64/python3.12/site-packages/ldap/syncrepl.py to syncrepl.cpython-312.pyc
byte-compiling /builddir/build/BUILDROOT/python-ldap-3.4.3-4.fc40.riscv64/usr/lib64/python3.12/site-packages/ldif.py to ldif.cpython-312.pyc
byte-compiling /builddir/build/BUILDROOT/python-ldap-3.4.3-4.fc40.riscv64/usr/lib64/python3.12/site-packages/slapdtest/_slapdtest.py to _slapdtest.cpython-312.pyc
byte-compiling /builddir/build/BUILDROOT/python-ldap-3.4.3-4.fc40.riscv64/usr/lib64/python3.12/site-packages/slapdtest/__init__.py to __init__.cpython-312.pyc
writing byte-compilation script '/tmp/tmpj0bcdjsw.py'
/usr/bin/python3 /tmp/tmpj0bcdjsw.py
removing /tmp/tmpj0bcdjsw.py
running install_egg_info
running egg_info
writing Lib/python_ldap.egg-info/PKG-INFO
writing dependency_links to Lib/python_ldap.egg-info/dependency_links.txt
writing requirements to Lib/python_ldap.egg-info/requires.txt
writing top-level names to Lib/python_ldap.egg-info/top_level.txt
reading manifest file 'Lib/python_ldap.egg-info/SOURCES.txt'
reading manifest template 'MANIFEST.in'
no previously-included directories found matching 'Doc/.build'
adding license file 'LICENCE'
writing manifest file 'Lib/python_ldap.egg-info/SOURCES.txt'
Copying Lib/python_ldap.egg-info to /builddir/build/BUILDROOT/python-ldap-3.4.3-4.fc40.riscv64/usr/lib64/python3.12/site-packages/python_ldap-3.4.3-py3.12.egg-info
running install_scripts
+ rm -rfv /builddir/build/BUILDROOT/python-ldap-3.4.3-4.fc40.riscv64/usr/bin/__pycache__
+ /usr/bin/find-debuginfo -j4 --strict-build-id -m -i --build-id-seed 3.4.3-4.fc40 --unique-debug-suffix -3.4.3-4.fc40.riscv64 --unique-debug-src-base python-ldap-3.4.3-4.fc40.riscv64 --run-dwz --dwz-low-mem-die-limit 10000000 --dwz-max-die-limit 50000000 -S debugsourcefiles.list /builddir/build/BUILD/python-ldap-3.4.3
find-debuginfo: starting
Extracting debug info from 1 files
DWARF-compressing 1 files
sepdebugcrcfix: Updated 1 CRC32s, 0 CRC32s did match.
Creating .debug symlinks for symlinks to ELF files
Copying sources found by 'debugedit -l' to /usr/src/debug/python-ldap-3.4.3-4.fc40.riscv64
208 blocks
find-debuginfo: done
+ /usr/lib/rpm/check-buildroot
+ /usr/lib/rpm/redhat/brp-ldconfig
+ /usr/lib/rpm/brp-compress
+ /usr/lib/rpm/redhat/brp-strip-lto /usr/bin/strip
+ /usr/lib/rpm/brp-strip-static-archive /usr/bin/strip
+ /usr/lib/rpm/check-rpaths
+ /usr/lib/rpm/redhat/brp-mangle-shebangs
mangling shebang in /usr/lib64/python3.12/site-packages/slapdtest/certs/gennssdb.sh from /bin/sh to #!/usr/bin/sh
mangling shebang in /usr/lib64/python3.12/site-packages/slapdtest/certs/gencerts.sh from /bin/sh to #!/usr/bin/sh
*** WARNING: ./usr/lib64/python3.12/site-packages/python_ldap-3.4.3-py3.12.egg-info/SOURCES.txt is executable but has no shebang, removing executable bit
*** WARNING: ./usr/lib64/python3.12/site-packages/python_ldap-3.4.3-py3.12.egg-info/requires.txt is executable but has no shebang, removing executable bit
*** WARNING: ./usr/lib64/python3.12/site-packages/python_ldap-3.4.3-py3.12.egg-info/top_level.txt is executable but has no shebang, removing executable bit
+ /usr/lib/rpm/brp-remove-la-files
+ env /usr/lib/rpm/redhat/brp-python-bytecompile '' 1 0 -j4
Bytecompiling .py files below /builddir/build/BUILDROOT/python-ldap-3.4.3-4.fc40.riscv64/usr/lib64/python3.12 using python3.12
Bytecompiling .py files below /builddir/build/BUILDROOT/python-ldap-3.4.3-4.fc40.riscv64/usr/lib/debug/usr/lib64/python3.12 using python3.12
+ /usr/lib/rpm/redhat/brp-python-hardlink
Executing(%check): /bin/sh -e /var/tmp/rpm-tmp.twFBgg
+ umask 022
+ cd /builddir/build/BUILD
+ CFLAGS='-O2 -flto=auto -ffat-lto-objects -fexceptions -g -grecord-gcc-switches -pipe -Wall -Werror=format-security -Werror=implicit-function-declaration -Werror=implicit-int -Wp,-U_FORTIFY_SOURCE,-D_FORTIFY_SOURCE=3 -Wp,-D_GLIBCXX_ASSERTIONS -specs=/usr/lib/rpm/redhat/redhat-hardened-cc1 -fstack-protector-strong -specs=/usr/lib/rpm/redhat/redhat-annobin-cc1  -fasynchronous-unwind-tables -fno-omit-frame-pointer '
+ export CFLAGS
+ CXXFLAGS='-O2 -flto=auto -ffat-lto-objects -fexceptions -g -grecord-gcc-switches -pipe -Wall -Werror=format-security -Wp,-U_FORTIFY_SOURCE,-D_FORTIFY_SOURCE=3 -Wp,-D_GLIBCXX_ASSERTIONS -specs=/usr/lib/rpm/redhat/redhat-hardened-cc1 -fstack-protector-strong -specs=/usr/lib/rpm/redhat/redhat-annobin-cc1  -fasynchronous-unwind-tables -fno-omit-frame-pointer '
+ export CXXFLAGS
+ FFLAGS='-O2 -flto=auto -ffat-lto-objects -fexceptions -g -grecord-gcc-switches -pipe -Wall -Wp,-U_FORTIFY_SOURCE,-D_FORTIFY_SOURCE=3 -Wp,-D_GLIBCXX_ASSERTIONS -specs=/usr/lib/rpm/redhat/redhat-hardened-cc1 -fstack-protector-strong -specs=/usr/lib/rpm/redhat/redhat-annobin-cc1  -fasynchronous-unwind-tables -fno-omit-frame-pointer -I/usr/lib64/gfortran/modules '
+ export FFLAGS
+ FCFLAGS='-O2 -flto=auto -ffat-lto-objects -fexceptions -g -grecord-gcc-switches -pipe -Wall -Wp,-U_FORTIFY_SOURCE,-D_FORTIFY_SOURCE=3 -Wp,-D_GLIBCXX_ASSERTIONS -specs=/usr/lib/rpm/redhat/redhat-hardened-cc1 -fstack-protector-strong -specs=/usr/lib/rpm/redhat/redhat-annobin-cc1  -fasynchronous-unwind-tables -fno-omit-frame-pointer -I/usr/lib64/gfortran/modules '
+ export FCFLAGS
+ VALAFLAGS=-g
+ export VALAFLAGS
+ RUSTFLAGS='-Copt-level=3 -Cdebuginfo=2 -Ccodegen-units=1 -Cforce-frame-pointers=yes -Clink-arg=-Wl,-z,relro -Clink-arg=-Wl,-z,now -Clink-arg=-specs=/usr/lib/rpm/redhat/redhat-package-notes --cap-lints=warn'
+ export RUSTFLAGS
+ LDFLAGS='-Wl,-z,relro -Wl,--as-needed  -Wl,-z,now -specs=/usr/lib/rpm/redhat/redhat-hardened-ld -specs=/usr/lib/rpm/redhat/redhat-annobin-cc1  -Wl,--build-id=sha1 -specs=/usr/lib/rpm/redhat/redhat-package-notes '
+ export LDFLAGS
+ LT_SYS_LIBRARY_PATH=/usr/lib64:
+ export LT_SYS_LIBRARY_PATH
+ CC=gcc
+ export CC
+ CXX=g++
+ export CXX
+ cd python-ldap-3.4.3
+ PYTHONPATH=/builddir/build/BUILDROOT/python-ldap-3.4.3-4.fc40.riscv64/usr/lib64/python3.12/site-packages
+ /usr/bin/python3 -m unittest discover -v -s Tests -p 't_*'
test_simple_bind (t_bind.TestBinds.test_simple_bind) ... ok
test_unicode_bind (t_bind.TestBinds.test_unicode_bind) ... ok
test_unicode_bind_no_bytesmode (t_bind.TestBinds.test_unicode_bind_no_bytesmode) ... ok
test_abandon (t_cext.TestLdapCExtension.test_abandon) ... ok
test_add (t_cext.TestLdapCExtension.test_add)
test add operation ... ok
test_anon_rootdse_search (t_cext.TestLdapCExtension.test_anon_rootdse_search) ... ok
test_cancel (t_cext.TestLdapCExtension.test_cancel) ... ok
test_compare (t_cext.TestLdapCExtension.test_compare)
test compare operation ... ok
test_constants (t_cext.TestLdapCExtension.test_constants)
Test whether all libldap-derived constants are correct ... ok
test_delete (t_cext.TestLdapCExtension.test_delete) ... ok
test_delete_no_such_object (t_cext.TestLdapCExtension.test_delete_no_such_object)
try deleting an object that doesn't exist ... ok
test_enotconn (t_cext.TestLdapCExtension.test_enotconn) ... ok
test_invalid_controls (t_cext.TestLdapCExtension.test_invalid_controls) ... ok
test_invalid_credentials (t_cext.TestLdapCExtension.test_invalid_credentials) ... ok
test_invalid_filter (t_cext.TestLdapCExtension.test_invalid_filter) ... ok
test_invalid_search_filter (t_cext.TestLdapCExtension.test_invalid_search_filter) ... ok
test_modify (t_cext.TestLdapCExtension.test_modify)
test modify operation ... ok
test_modify_no_such_object (t_cext.TestLdapCExtension.test_modify_no_such_object) ... ok
test_modify_no_such_object_empty_attrs (t_cext.TestLdapCExtension.test_modify_no_such_object_empty_attrs)
try deleting an object that doesn't exist ... ok
test_options (t_cext.TestLdapCExtension.test_options) ... ok
test_passwd (t_cext.TestLdapCExtension.test_passwd) ... ok
test_rename (t_cext.TestLdapCExtension.test_rename) ... ok
test_require_san (t_cext.TestLdapCExtension.test_require_san) ... ok
test_sasl (t_cext.TestLdapCExtension.test_sasl) ... ok
test_search_ext_all (t_cext.TestLdapCExtension.test_search_ext_all) ... ok
test_search_ext_individual (t_cext.TestLdapCExtension.test_search_ext_individual) ... ok
test_simple_anonymous_bind (t_cext.TestLdapCExtension.test_simple_anonymous_bind) ... ok
test_simple_bind (t_cext.TestLdapCExtension.test_simple_bind) ... ok
test_simple_bind_fileno (t_cext.TestLdapCExtension.test_simple_bind_fileno) ... ok
test_simple_bind_fileno_closed (t_cext.TestLdapCExtension.test_simple_bind_fileno_closed) ... ok
test_simple_bind_fileno_invalid (t_cext.TestLdapCExtension.test_simple_bind_fileno_invalid) ... ok
test_simple_bind_fileno_rebind (t_cext.TestLdapCExtension.test_simple_bind_fileno_rebind) ... ok
test_test_flags (t_cext.TestLdapCExtension.test_test_flags) ... skipped 'No CI_DISABLED env var'
test_tls_ext (t_cext.TestLdapCExtension.test_tls_ext) ... ok
test_tls_ext_clientcert (t_cext.TestLdapCExtension.test_tls_ext_clientcert) ... ok
test_tls_ext_noca (t_cext.TestLdapCExtension.test_tls_ext_noca) ... ok
test_tls_packages (t_cext.TestLdapCExtension.test_tls_packages) ... ok
test_tls_require_cert (t_cext.TestLdapCExtension.test_tls_require_cert) ... ok
test_unbind (t_cext.TestLdapCExtension.test_unbind) ... ok
test_whoami (t_cext.TestLdapCExtension.test_whoami) ... ok
test_whoami_after_unbind (t_cext.TestLdapCExtension.test_whoami_after_unbind) ... ok
test_whoami_anonymous (t_cext.TestLdapCExtension.test_whoami_anonymous) ... ok
test_whoami_unbound (t_cext.TestLdapCExtension.test_whoami_unbound) ... ok
test_cidict (t_cidict.TestCidict.test_cidict)
test function is_dn() ... ok
test_cidict_data (t_cidict.TestCidict.test_cidict_data)
test the deprecated data atrtribute ... ok
test_copy (t_cidict.TestCidict.test_copy) ... ok
test_strlist_deprecated (t_cidict.TestCidict.test_strlist_deprecated) ... ok
test_add_object (t_edit.EditionTests.test_add_object) ... ok
test_deprecated (t_ldap_asyncsearch.TestLdapAsyncSearch.test_deprecated) ... ok
test_assertioncontrol (t_ldap_controls_libldap.TestLibldapControls.test_assertioncontrol) ... ok
test_matchedvalues (t_ldap_controls_libldap.TestLibldapControls.test_matchedvalues) ... ok
test_pagedresults_decode (t_ldap_controls_libldap.TestLibldapControls.test_pagedresults_decode) ... ok
test_pagedresults_encode (t_ldap_controls_libldap.TestLibldapControls.test_pagedresults_encode) ... ok
test_ppolicy_graceauth (t_ldap_controls_ppolicy.TestControlsPPolicy.test_ppolicy_graceauth) ... ok
test_ppolicy_timebefore (t_ldap_controls_ppolicy.TestControlsPPolicy.test_ppolicy_timebefore) ... ok
test_pagedresults_encode (t_ldap_controls_readentry.TestLibldapControls.test_pagedresults_encode) ... ok
test_readentry_decode (t_ldap_controls_readentry.TestLibldapControls.test_readentry_decode) ... ok
test_create_sss_request_control (t_ldap_controls_sss.TestControlsPPolicy.test_create_sss_request_control) ... ok
test_dn2str (t_ldap_dn.TestDN.test_dn2str)
test function dn2str() ... ok
test_escape_dn_chars (t_ldap_dn.TestDN.test_escape_dn_chars)
test function escape_dn_chars() ... ok
test_explode_dn (t_ldap_dn.TestDN.test_explode_dn)
test function explode_dn() ... ok
test_explode_rdn (t_ldap_dn.TestDN.test_explode_rdn)
test function explode_rdn() ... ok
test_is_dn (t_ldap_dn.TestDN.test_is_dn)
test function is_dn() ... ok
test_str2dn (t_ldap_dn.TestDN.test_str2dn)
test function str2dn() ... ok
test_escape_filter_chars_mode0 (t_ldap_filter.TestDN.test_escape_filter_chars_mode0)
test function escape_filter_chars() with escape_mode=0 ... ok
test_escape_filter_chars_mode1 (t_ldap_filter.TestDN.test_escape_filter_chars_mode1)
test function escape_filter_chars() with escape_mode=1 ... ok
test_escape_filter_chars_mode2 (t_ldap_filter.TestDN.test_escape_filter_chars_mode2)
test function escape_filter_chars() with escape_mode=2 ... ok
test_escape_str (t_ldap_functions.TestFunction.test_escape_str)
test function escape_string_tmpl() ... ok
test_ldap_strf_secs (t_ldap_functions.TestFunction.test_ldap_strf_secs)
test function ldap_strf_secs() ... ok
test_ldap_strp_secs (t_ldap_functions.TestFunction.test_ldap_strp_secs)
test function ldap_strp_secs() ... ok
test_addModlist (t_ldap_modlist.TestModlist.test_addModlist) ... ok
test_modifyModlist (t_ldap_modlist.TestModlist.test_modifyModlist) ... ok
test_cafile (t_ldap_options.TestGlobalOptions.test_cafile) ... ok
test_client_controls (t_ldap_options.TestGlobalOptions.test_client_controls) ... ok
test_invalid (t_ldap_options.TestGlobalOptions.test_invalid) ... ok
test_network_timeout (t_ldap_options.TestGlobalOptions.test_network_timeout) ... ERROR
test_readonly (t_ldap_options.TestGlobalOptions.test_readonly) ... ok
test_server_controls (t_ldap_options.TestGlobalOptions.test_server_controls) ... ok
test_timeout (t_ldap_options.TestGlobalOptions.test_timeout) ... ERROR
test_uri (t_ldap_options.TestGlobalOptions.test_uri) ... ok
test_cafile (t_ldap_options.TestLDAPObjectOptions.test_cafile) ... ok
test_client_controls (t_ldap_options.TestLDAPObjectOptions.test_client_controls) ... expected failure
test_invalid (t_ldap_options.TestLDAPObjectOptions.test_invalid) ... ok
test_network_timeout (t_ldap_options.TestLDAPObjectOptions.test_network_timeout) ... ERROR
test_network_timeout_attribute (t_ldap_options.TestLDAPObjectOptions.test_network_timeout_attribute) ... ok
test_readonly (t_ldap_options.TestLDAPObjectOptions.test_readonly) ... ok
test_server_controls (t_ldap_options.TestLDAPObjectOptions.test_server_controls) ... expected failure
test_timeout (t_ldap_options.TestLDAPObjectOptions.test_timeout) ... ERROR
test_uri (t_ldap_options.TestLDAPObjectOptions.test_uri) ... ok
test_external_ldapi (t_ldap_sasl.TestSasl.test_external_ldapi) ... ok
test_external_tlscert (t_ldap_sasl.TestSasl.test_external_tlscert) ... ok
test_attributetype_attrs (t_ldap_schema_subentry.TestAttributes.test_attributetype_attrs)
Check types and values of an AttributeType object's attributes ... ok
test_empty_attributetype_attrs (t_ldap_schema_subentry.TestAttributes.test_empty_attributetype_attrs)
Check types and values of attributes of a minimal AttributeType ... ok
test_empty_objectclass_attrs (t_ldap_schema_subentry.TestAttributes.test_empty_objectclass_attrs)
Check types and values of attributes of a minimal ObjectClass ... ok
test_objectclass_attrs (t_ldap_schema_subentry.TestAttributes.test_objectclass_attrs)
Check types and values of an ObjectClass object's attributes ... ok
test_subschema_file (t_ldap_schema_subentry.TestSubschemaLDIF.test_subschema_file) ... ok
test_urlfetch_file (t_ldap_schema_subentry.TestSubschemaUrlfetch.test_urlfetch_file) ... ok
test_urlfetch_ldap (t_ldap_schema_subentry.TestSubschemaUrlfetchSlapd.test_urlfetch_ldap) ... ok
test_urlfetch_ldapi (t_ldap_schema_subentry.TestSubschemaUrlfetchSlapd.test_urlfetch_ldapi) ... ok
test_origin_multi_valued (t_ldap_schema_subentry.TestXOrigin.test_origin_multi_valued) ... ok
test_origin_multi_valued_str (t_ldap_schema_subentry.TestXOrigin.test_origin_multi_valued_str)
Check string representation of an attr with multi-value X-ORIGIN ... ok
test_origin_none (t_ldap_schema_subentry.TestXOrigin.test_origin_none) ... ok
test_origin_none_str (t_ldap_schema_subentry.TestXOrigin.test_origin_none_str)
Check string representation of an attribute without X-ORIGIN ... ok
test_origin_string (t_ldap_schema_subentry.TestXOrigin.test_origin_string) ... ok
test_origin_string_str (t_ldap_schema_subentry.TestXOrigin.test_origin_string_str)
Check string representation of an attr with single-value X-ORIGIN ... ok
test_set_origin_list (t_ldap_schema_subentry.TestXOrigin.test_set_origin_list)
Check that setting X-ORIGIN to a list makes entry unusable ... ok
test_set_origin_str (t_ldap_schema_subentry.TestXOrigin.test_set_origin_str)
Check that setting X-ORIGIN to a string makes entry unusable ... ok
test_set_origin_tuple (t_ldap_schema_subentry.TestXOrigin.test_set_origin_tuple)
Check that setting X-ORIGIN to a tuple works ... ok
test_basic (t_ldap_schema_tokenizer.TestSplitTokens.test_basic)
run test cases specified in constant TESTCASES_BASIC ... ok
test_broken (t_ldap_schema_tokenizer.TestSplitTokens.test_broken) ... ok
test_broken_oid (t_ldap_schema_tokenizer.TestSplitTokens.test_broken_oid)
run test cases specified in constant TESTCASES_BROKEN_OID ... ok
test_escaped_quotes (t_ldap_schema_tokenizer.TestSplitTokens.test_escaped_quotes)
run test cases specified in constant TESTCASES_ESCAPED_QUOTES ... ok
test_utf8 (t_ldap_schema_tokenizer.TestSplitTokens.test_utf8)
run test cases specified in constant TESTCASES_BASIC ... ok
test_syncidset_message (t_ldap_syncrepl.DecodeSyncreplProtoTests.test_syncidset_message)
A syncrepl server may send a sync info message, with a syncIdSet ... ok
test_refreshAndPersist_cancelled (t_ldap_syncrepl.TestSyncrepl.test_refreshAndPersist_cancelled)
Make sure refreshAndPersist can handle cancelling a syncrepl search. ... ok
test_refreshAndPersist_poll_only (t_ldap_syncrepl.TestSyncrepl.test_refreshAndPersist_poll_only)
Test the refresh part of refresh-and-persist, and check what we got. ... ok
test_refreshAndPersist_search (t_ldap_syncrepl.TestSyncrepl.test_refreshAndPersist_search) ... ok
test_refreshAndPersist_timeout (t_ldap_syncrepl.TestSyncrepl.test_refreshAndPersist_timeout)
Make sure refreshAndPersist can handle a search with timeouts. ... ok
test_refreshOnly_poll_full (t_ldap_syncrepl.TestSyncrepl.test_refreshOnly_poll_full)
Test doing a full refresh cycle, and check what we got. ... ok
test_refreshOnly_search (t_ldap_syncrepl.TestSyncrepl.test_refreshOnly_search)
Test to see if we can initialize a syncrepl search. ... ok
test001_search_subtree (t_ldapobject.Test00_SimpleLDAPObject.test001_search_subtree) ... ok
test002_search_onelevel (t_ldapobject.Test00_SimpleLDAPObject.test002_search_onelevel) ... ok
test003_search_oneattr (t_ldapobject.Test00_SimpleLDAPObject.test003_search_oneattr) ... ok
test004_enotconn (t_ldapobject.Test00_SimpleLDAPObject.test004_enotconn) ... ok
test005_invalid_credentials (t_ldapobject.Test00_SimpleLDAPObject.test005_invalid_credentials) ... ok
test006_sasl_external_bind_s (t_ldapobject.Test00_SimpleLDAPObject.test006_sasl_external_bind_s) ... ok
test006_sasl_options (t_ldapobject.Test00_SimpleLDAPObject.test006_sasl_options) ... ok
test007_timeout (t_ldapobject.Test00_SimpleLDAPObject.test007_timeout) ... ok
test_async_search_no_such_object_exception_contains_message_id (t_ldapobject.Test00_SimpleLDAPObject.test_async_search_no_such_object_exception_contains_message_id) ... ok
test_attrlist_accepts_unicode (t_ldapobject.Test00_SimpleLDAPObject.test_attrlist_accepts_unicode) ... ok
test_compare_s_false (t_ldapobject.Test00_SimpleLDAPObject.test_compare_s_false) ... ok
test_compare_s_invalidattr (t_ldapobject.Test00_SimpleLDAPObject.test_compare_s_invalidattr) ... ok
test_compare_s_notfound (t_ldapobject.Test00_SimpleLDAPObject.test_compare_s_notfound) ... ok
test_compare_s_true (t_ldapobject.Test00_SimpleLDAPObject.test_compare_s_true) ... ok
test_compare_true_exception_contains_message_id (t_ldapobject.Test00_SimpleLDAPObject.test_compare_true_exception_contains_message_id) ... ok
test_dse (t_ldapobject.Test00_SimpleLDAPObject.test_dse) ... ok
test_filterstr_accepts_unicode (t_ldapobject.Test00_SimpleLDAPObject.test_filterstr_accepts_unicode) ... ok
test_find_unique_entry (t_ldapobject.Test00_SimpleLDAPObject.test_find_unique_entry) ... ok
test_get_tls_peercert (t_ldapobject.Test00_SimpleLDAPObject.test_get_tls_peercert) ... ok
test_multiple_starttls (t_ldapobject.Test00_SimpleLDAPObject.test_multiple_starttls) ... ok
test_passwd_s (t_ldapobject.Test00_SimpleLDAPObject.test_passwd_s) ... ok
test_reject_bytes_base (t_ldapobject.Test00_SimpleLDAPObject.test_reject_bytes_base) ... ok
test_search_accepts_unicode_dn (t_ldapobject.Test00_SimpleLDAPObject.test_search_accepts_unicode_dn) ... ok
test_search_keys_are_text (t_ldapobject.Test00_SimpleLDAPObject.test_search_keys_are_text) ... ok
test_search_subschema (t_ldapobject.Test00_SimpleLDAPObject.test_search_subschema) ... ok
test_simple_bind_noarg (t_ldapobject.Test00_SimpleLDAPObject.test_simple_bind_noarg) ... ok
test_slapadd (t_ldapobject.Test00_SimpleLDAPObject.test_slapadd) ... ok
test001_search_subtree (t_ldapobject.Test01_ReconnectLDAPObject.test001_search_subtree) ... ok
test002_search_onelevel (t_ldapobject.Test01_ReconnectLDAPObject.test002_search_onelevel) ... ok
test003_search_oneattr (t_ldapobject.Test01_ReconnectLDAPObject.test003_search_oneattr) ... ok
test004_enotconn (t_ldapobject.Test01_ReconnectLDAPObject.test004_enotconn) ... ok
test005_invalid_credentials (t_ldapobject.Test01_ReconnectLDAPObject.test005_invalid_credentials) ... ok
test006_sasl_external_bind_s (t_ldapobject.Test01_ReconnectLDAPObject.test006_sasl_external_bind_s) ... ok
test006_sasl_options (t_ldapobject.Test01_ReconnectLDAPObject.test006_sasl_options) ... ok
test007_timeout (t_ldapobject.Test01_ReconnectLDAPObject.test007_timeout) ... ok
test101_reconnect_sasl_external (t_ldapobject.Test01_ReconnectLDAPObject.test101_reconnect_sasl_external) ... ok
test102_reconnect_simple_bind (t_ldapobject.Test01_ReconnectLDAPObject.test102_reconnect_simple_bind) ... ok
test103_reconnect_get_state (t_ldapobject.Test01_ReconnectLDAPObject.test103_reconnect_get_state) ... ok
test104_reconnect_restore (t_ldapobject.Test01_ReconnectLDAPObject.test104_reconnect_restore) ... ok
test105_reconnect_restore (t_ldapobject.Test01_ReconnectLDAPObject.test105_reconnect_restore) ... ok
test_async_search_no_such_object_exception_contains_message_id (t_ldapobject.Test01_ReconnectLDAPObject.test_async_search_no_such_object_exception_contains_message_id) ... ok
test_attrlist_accepts_unicode (t_ldapobject.Test01_ReconnectLDAPObject.test_attrlist_accepts_unicode) ... ok
test_compare_s_false (t_ldapobject.Test01_ReconnectLDAPObject.test_compare_s_false) ... ok
test_compare_s_invalidattr (t_ldapobject.Test01_ReconnectLDAPObject.test_compare_s_invalidattr) ... ok
test_compare_s_notfound (t_ldapobject.Test01_ReconnectLDAPObject.test_compare_s_notfound) ... ok
test_compare_s_true (t_ldapobject.Test01_ReconnectLDAPObject.test_compare_s_true) ... ok
test_compare_true_exception_contains_message_id (t_ldapobject.Test01_ReconnectLDAPObject.test_compare_true_exception_contains_message_id) ... ok
test_dse (t_ldapobject.Test01_ReconnectLDAPObject.test_dse) ... ok
test_filterstr_accepts_unicode (t_ldapobject.Test01_ReconnectLDAPObject.test_filterstr_accepts_unicode) ... ok
test_find_unique_entry (t_ldapobject.Test01_ReconnectLDAPObject.test_find_unique_entry) ... ok
test_get_tls_peercert (t_ldapobject.Test01_ReconnectLDAPObject.test_get_tls_peercert) ... ok
test_multiple_starttls (t_ldapobject.Test01_ReconnectLDAPObject.test_multiple_starttls) ... ok
test_passwd_s (t_ldapobject.Test01_ReconnectLDAPObject.test_passwd_s) ... ok
test_reject_bytes_base (t_ldapobject.Test01_ReconnectLDAPObject.test_reject_bytes_base) ... ok
test_search_accepts_unicode_dn (t_ldapobject.Test01_ReconnectLDAPObject.test_search_accepts_unicode_dn) ... ok
test_search_keys_are_text (t_ldapobject.Test01_ReconnectLDAPObject.test_search_keys_are_text) ... ok
test_search_subschema (t_ldapobject.Test01_ReconnectLDAPObject.test_search_subschema) ... ok
test_simple_bind_noarg (t_ldapobject.Test01_ReconnectLDAPObject.test_simple_bind_noarg) ... ok
test_slapadd (t_ldapobject.Test01_ReconnectLDAPObject.test_slapadd) ... ok
test001_search_subtree (t_ldapobject.Test03_SimpleLDAPObjectWithFileno.test001_search_subtree) ... ok
test002_search_onelevel (t_ldapobject.Test03_SimpleLDAPObjectWithFileno.test002_search_onelevel) ... ok
test003_search_oneattr (t_ldapobject.Test03_SimpleLDAPObjectWithFileno.test003_search_oneattr) ... ok
test004_enotconn (t_ldapobject.Test03_SimpleLDAPObjectWithFileno.test004_enotconn) ... ok
test005_invalid_credentials (t_ldapobject.Test03_SimpleLDAPObjectWithFileno.test005_invalid_credentials) ... ok
test006_sasl_external_bind_s (t_ldapobject.Test03_SimpleLDAPObjectWithFileno.test006_sasl_external_bind_s) ... ok
test006_sasl_options (t_ldapobject.Test03_SimpleLDAPObjectWithFileno.test006_sasl_options) ... ok
test007_timeout (t_ldapobject.Test03_SimpleLDAPObjectWithFileno.test007_timeout) ... ok
test_async_search_no_such_object_exception_contains_message_id (t_ldapobject.Test03_SimpleLDAPObjectWithFileno.test_async_search_no_such_object_exception_contains_message_id) ... ok
test_attrlist_accepts_unicode (t_ldapobject.Test03_SimpleLDAPObjectWithFileno.test_attrlist_accepts_unicode) ... ok
test_compare_s_false (t_ldapobject.Test03_SimpleLDAPObjectWithFileno.test_compare_s_false) ... ok
test_compare_s_invalidattr (t_ldapobject.Test03_SimpleLDAPObjectWithFileno.test_compare_s_invalidattr) ... ok
test_compare_s_notfound (t_ldapobject.Test03_SimpleLDAPObjectWithFileno.test_compare_s_notfound) ... ok
test_compare_s_true (t_ldapobject.Test03_SimpleLDAPObjectWithFileno.test_compare_s_true) ... ok
test_compare_true_exception_contains_message_id (t_ldapobject.Test03_SimpleLDAPObjectWithFileno.test_compare_true_exception_contains_message_id) ... ok
test_dse (t_ldapobject.Test03_SimpleLDAPObjectWithFileno.test_dse) ... ok
test_filterstr_accepts_unicode (t_ldapobject.Test03_SimpleLDAPObjectWithFileno.test_filterstr_accepts_unicode) ... ok
test_find_unique_entry (t_ldapobject.Test03_SimpleLDAPObjectWithFileno.test_find_unique_entry) ... ok
test_get_tls_peercert (t_ldapobject.Test03_SimpleLDAPObjectWithFileno.test_get_tls_peercert) ... ok
test_multiple_starttls (t_ldapobject.Test03_SimpleLDAPObjectWithFileno.test_multiple_starttls) ... ok
test_passwd_s (t_ldapobject.Test03_SimpleLDAPObjectWithFileno.test_passwd_s) ... ok
test_reject_bytes_base (t_ldapobject.Test03_SimpleLDAPObjectWithFileno.test_reject_bytes_base) ... ok
test_search_accepts_unicode_dn (t_ldapobject.Test03_SimpleLDAPObjectWithFileno.test_search_accepts_unicode_dn) ... ok
test_search_keys_are_text (t_ldapobject.Test03_SimpleLDAPObjectWithFileno.test_search_keys_are_text) ... ok
test_search_subschema (t_ldapobject.Test03_SimpleLDAPObjectWithFileno.test_search_subschema) ... ok
test_simple_bind_noarg (t_ldapobject.Test03_SimpleLDAPObjectWithFileno.test_simple_bind_noarg) ... ok
test_slapadd (t_ldapobject.Test03_SimpleLDAPObjectWithFileno.test_slapadd) ... ok
test_isLDAPUrl (t_ldapurl.TestIsLDAPUrl.test_isLDAPUrl) ... ok
test_bad_urls (t_ldapurl.TestLDAPUrl.test_bad_urls) ... expected failure
test_combo (t_ldapurl.TestLDAPUrl.test_combo) ... ok
test_parse_attrs (t_ldapurl.TestLDAPUrl.test_parse_attrs) ... ok
test_parse_default_attrs (t_ldapurl.TestLDAPUrl.test_parse_default_attrs) ... ok
test_parse_default_extensions (t_ldapurl.TestLDAPUrl.test_parse_default_extensions) ... ok
test_parse_default_filter (t_ldapurl.TestLDAPUrl.test_parse_default_filter) ... ok
test_parse_default_hostport (t_ldapurl.TestLDAPUrl.test_parse_default_hostport) ... ok
test_parse_default_scope (t_ldapurl.TestLDAPUrl.test_parse_default_scope) ... ok
test_parse_dn (t_ldapurl.TestLDAPUrl.test_parse_dn) ... ok
test_parse_empty_dn (t_ldapurl.TestLDAPUrl.test_parse_empty_dn) ... ok
test_parse_extensions (t_ldapurl.TestLDAPUrl.test_parse_extensions) ... ok
test_parse_extensions_5questions (t_ldapurl.TestLDAPUrl.test_parse_extensions_5questions) ... ok
test_parse_extensions_novalue (t_ldapurl.TestLDAPUrl.test_parse_extensions_novalue) ... ok
test_parse_extensions_nulls (t_ldapurl.TestLDAPUrl.test_parse_extensions_nulls) ... ok
test_parse_filter (t_ldapurl.TestLDAPUrl.test_parse_filter) ... ok
test_parse_hostport (t_ldapurl.TestLDAPUrl.test_parse_hostport) ... ok
test_parse_schemes (t_ldapurl.TestLDAPUrl.test_parse_schemes) ... ok
test_parse_scope (t_ldapurl.TestLDAPUrl.test_parse_scope) ... ok
test_parse_scope_default (t_ldapurl.TestLDAPUrl.test_parse_scope_default) ... ok
test_ldapurl (t_ldapurl.TestParseLDAPUrl.test_ldapurl) ... ok
test_bad_change_records (t_ldif.TestChangeRecords.test_bad_change_records) ... ok
test_empty (t_ldif.TestChangeRecords.test_empty) ... ok
test_missing_trailing_dash_separator (t_ldif.TestChangeRecords.test_missing_trailing_dash_separator) ... ok
test_mod_increment (t_ldif.TestChangeRecords.test_mod_increment) ... ok
test_simple (t_ldif.TestChangeRecords.test_simple) ... ok
test_weird_empty_lines (t_ldif.TestChangeRecords.test_weird_empty_lines) ... ok
test_big_binary (t_ldif.TestEntryRecords.test_big_binary) ... ok
test_binary (t_ldif.TestEntryRecords.test_binary) ... ok
test_binary2 (t_ldif.TestEntryRecords.test_binary2) ... ok
test_comments (t_ldif.TestEntryRecords.test_comments) ... ok
test_empty (t_ldif.TestEntryRecords.test_empty) ... ok
test_empty_attr_values (t_ldif.TestEntryRecords.test_empty_attr_values) ... ok
test_folded (t_ldif.TestEntryRecords.test_folded) ... ok
test_ignored_attr_types (t_ldif.TestEntryRecords.test_ignored_attr_types) ... ok
test_max_entries (t_ldif.TestEntryRecords.test_max_entries) ... ok
test_missing_trailing_line_separator (t_ldif.TestEntryRecords.test_missing_trailing_line_separator) ... ok
test_multiple (t_ldif.TestEntryRecords.test_multiple) ... ok
test_multiple_empty_lines (t_ldif.TestEntryRecords.test_multiple_empty_lines)
test malformed LDIF with multiple empty lines ... ok
test_simple (t_ldif.TestEntryRecords.test_simple) ... ok
test_simple2 (t_ldif.TestEntryRecords.test_simple2) ... ok
test_sorted (t_ldif.TestEntryRecords.test_sorted) ... ok
test_unencoded_unicode (t_ldif.TestEntryRecords.test_unencoded_unicode) ... ok
test_unicode (t_ldif.TestEntryRecords.test_unicode) ... ok
test_weird_empty_lines (t_ldif.TestEntryRecords.test_weird_empty_lines) ... ok
test_context_manager (t_slapdobject.TestSlapdObject.test_context_manager) ... ok
test_context_manager_after_start (t_slapdobject.TestSlapdObject.test_context_manager_after_start) ... ok
======================================================================
ERROR: test_network_timeout (t_ldap_options.TestGlobalOptions.test_network_timeout)
----------------------------------------------------------------------
Traceback (most recent call last):
  File "/builddir/build/BUILD/python-ldap-3.4.3/Tests/t_ldap_options.py", line 84, in test_network_timeout
    self._test_timeout(ldap.OPT_NETWORK_TIMEOUT)
  File "/builddir/build/BUILD/python-ldap-3.4.3/Tests/t_ldap_options.py", line 66, in _test_timeout
    self._check_option(option, -5)
  File "/builddir/build/BUILD/python-ldap-3.4.3/Tests/t_ldap_options.py", line 46, in _check_option
    self.set_option(option, value)
  File "/builddir/build/BUILD/python-ldap-3.4.3/Tests/t_ldap_options.py", line 135, in set_option
    return ldap.set_option(option, value)
           ^^^^^^^^^^^^^^^^^^^^^^^^^^^^^^
  File "/builddir/build/BUILDROOT/python-ldap-3.4.3-4.fc40.riscv64/usr/lib64/python3.12/site-packages/ldap/functions.py", line 112, in set_option
    return _ldap_function_call(None,_ldap.set_option,option,invalue)
           ^^^^^^^^^^^^^^^^^^^^^^^^^^^^^^^^^^^^^^^^^^^^^^^^^^^^^^^^^
  File "/builddir/build/BUILDROOT/python-ldap-3.4.3-4.fc40.riscv64/usr/lib64/python3.12/site-packages/ldap/functions.py", line 52, in _ldap_function_call
    result = func(*args,**kwargs)
             ^^^^^^^^^^^^^^^^^^^^
SystemError: invalid format string: %f
======================================================================
ERROR: test_timeout (t_ldap_options.TestGlobalOptions.test_timeout)
----------------------------------------------------------------------
Traceback (most recent call last):
  File "/builddir/build/BUILD/python-ldap-3.4.3/Tests/t_ldap_options.py", line 81, in test_timeout
    self._test_timeout(ldap.OPT_TIMEOUT)
  File "/builddir/build/BUILD/python-ldap-3.4.3/Tests/t_ldap_options.py", line 66, in _test_timeout
    self._check_option(option, -5)
  File "/builddir/build/BUILD/python-ldap-3.4.3/Tests/t_ldap_options.py", line 46, in _check_option
    self.set_option(option, value)
  File "/builddir/build/BUILD/python-ldap-3.4.3/Tests/t_ldap_options.py", line 135, in set_option
    return ldap.set_option(option, value)
           ^^^^^^^^^^^^^^^^^^^^^^^^^^^^^^
  File "/builddir/build/BUILDROOT/python-ldap-3.4.3-4.fc40.riscv64/usr/lib64/python3.12/site-packages/ldap/functions.py", line 112, in set_option
    return _ldap_function_call(None,_ldap.set_option,option,invalue)
           ^^^^^^^^^^^^^^^^^^^^^^^^^^^^^^^^^^^^^^^^^^^^^^^^^^^^^^^^^
  File "/builddir/build/BUILDROOT/python-ldap-3.4.3-4.fc40.riscv64/usr/lib64/python3.12/site-packages/ldap/functions.py", line 52, in _ldap_function_call
    result = func(*args,**kwargs)
             ^^^^^^^^^^^^^^^^^^^^
SystemError: invalid format string: %f
======================================================================
ERROR: test_network_timeout (t_ldap_options.TestLDAPObjectOptions.test_network_timeout)
----------------------------------------------------------------------
Traceback (most recent call last):
  File "/builddir/build/BUILD/python-ldap-3.4.3/Tests/t_ldap_options.py", line 84, in test_network_timeout
    self._test_timeout(ldap.OPT_NETWORK_TIMEOUT)
  File "/builddir/build/BUILD/python-ldap-3.4.3/Tests/t_ldap_options.py", line 66, in _test_timeout
    self._check_option(option, -5)
  File "/builddir/build/BUILD/python-ldap-3.4.3/Tests/t_ldap_options.py", line 46, in _check_option
    self.set_option(option, value)
  File "/builddir/build/BUILD/python-ldap-3.4.3/Tests/t_ldap_options.py", line 158, in set_option
    return self.conn.set_option(option, value)
           ^^^^^^^^^^^^^^^^^^^^^^^^^^^^^^^^^^^
  File "/builddir/build/BUILDROOT/python-ldap-3.4.3-4.fc40.riscv64/usr/lib64/python3.12/site-packages/ldap/ldapobject.py", line 698, in set_option
    return self._ldap_call(self._l.set_option,option,invalue)
           ^^^^^^^^^^^^^^^^^^^^^^^^^^^^^^^^^^^^^^^^^^^^^^^^^^
  File "/builddir/build/BUILDROOT/python-ldap-3.4.3-4.fc40.riscv64/usr/lib64/python3.12/site-packages/ldap/ldapobject.py", line 128, in _ldap_call
    result = func(*args,**kwargs)
             ^^^^^^^^^^^^^^^^^^^^
SystemError: invalid format string: %f
======================================================================
ERROR: test_timeout (t_ldap_options.TestLDAPObjectOptions.test_timeout)
----------------------------------------------------------------------
Traceback (most recent call last):
  File "/builddir/build/BUILD/python-ldap-3.4.3/Tests/t_ldap_options.py", line 81, in test_timeout
    self._test_timeout(ldap.OPT_TIMEOUT)
  File "/builddir/build/BUILD/python-ldap-3.4.3/Tests/t_ldap_options.py", line 66, in _test_timeout
    self._check_option(option, -5)
  File "/builddir/build/BUILD/python-ldap-3.4.3/Tests/t_ldap_options.py", line 46, in _check_option
    self.set_option(option, value)
  File "/builddir/build/BUILD/python-ldap-3.4.3/Tests/t_ldap_options.py", line 158, in set_option
    return self.conn.set_option(option, value)
           ^^^^^^^^^^^^^^^^^^^^^^^^^^^^^^^^^^^
  File "/builddir/build/BUILDROOT/python-ldap-3.4.3-4.fc40.riscv64/usr/lib64/python3.12/site-packages/ldap/ldapobject.py", line 698, in set_option
    return self._ldap_call(self._l.set_option,option,invalue)
           ^^^^^^^^^^^^^^^^^^^^^^^^^^^^^^^^^^^^^^^^^^^^^^^^^^
  File "/builddir/build/BUILDROOT/python-ldap-3.4.3-4.fc40.riscv64/usr/lib64/python3.12/site-packages/ldap/ldapobject.py", line 128, in _ldap_call
    result = func(*args,**kwargs)
             ^^^^^^^^^^^^^^^^^^^^
SystemError: invalid format string: %f
----------------------------------------------------------------------
Ran 253 tests in 35.075s
FAILED (errors=4, skipped=1, expected failures=3)
error: Bad exit status from /var/tmp/rpm-tmp.twFBgg (%check)
    Bad exit status from /var/tmp/rpm-tmp.twFBgg (%check)
RPM build errors:
Child return code was: 1
EXCEPTION: [Error()]
Traceback (most recent call last):
  File "/usr/lib/python3.9/site-packages/mockbuild/trace_decorator.py", line 93, in trace
    result = func(*args, **kw)
  File "/usr/lib/python3.9/site-packages/mockbuild/util.py", line 600, in do_with_status
    raise exception.Error("Command failed: \n # %s\n%s" % (command, output), child.returncode)
mockbuild.exception.Error: Command failed: 
 # bash --login -c /usr/bin/rpmbuild -bb --target riscv64 --nodeps /builddir/build/SPECS/python-ldap.spec